简介:本资源是一份面向FPGA初学者与中级工程师的实战经验总结文档,聚焦数字电路设计思维转型、HDL编码规范与系统级优化技巧。内容源自一线工程师十年开发实践,深入剖析Verilog并行思维建模、组合逻辑中case与if-else的综合差异、数学思维简化乘法器设计、时钟与触发器的时序本质、IP核复用及乒乓操作等关键议题,并辅以秒表/抢答器等经典实验演进案例,帮助读者跨越原理图到HDL的认知鸿沟。资源为单文件Word文档(.doc),大小107KB,结构清晰、图文结合,便于快速查阅与笔记批注。目前已有1854人学习下载,适合正在学习《数字电路基础》、准备FPGA课程设计或项目实战的电子类专业学生及转岗工程师。
1. 这不是“经验总结”,是十年流片失败后撕下来的时序约束清单
你有没有在凌晨三点盯着 Vivado 的 Timing Summary 发呆:明明功能仿真全绿,上板一跑就丢数据?或者综合报告里突然冒出 27 个 unconstrained clock net,而你连这个时钟是从哪一级分频器蹦出来的都还没查清?这份 2014 年流传至今的《FPGA设计经验谈》文档,表面看是位老工程师的随笔,实则是用十几次 tape-out 失败、上百次板级调试崩溃换来的「反模式手册」——它不教你怎么写第一个always @(posedge clk),而是直击 FPGA 工程落地中最痛的五处骨裂:模型缺失导致的逻辑误判、组合路径隐性延时爆炸、数学直觉缺位引发的资源海啸、时钟域交叉失控、以及 IP 核滥用与乒乓操作失配。它适合两类人:一类是刚把module top编译通过、正准备连 JTAG 下载的新手,另一类是写了三年 Verilog 却总在跨时钟域握手环节翻车的中级工程师。文档里没有一行可直接复制的代码,但每一段都在告诉你:为什么你写的代码,综合器会把它变成你完全没想过的电路结构。
2. 看代码建模型:从 Verilog 文本到门级电路的脑内映射训练法
FPGA 开发最根本的认知断层,不在语法,而在「文本→硬件」的映射能力。新手常犯的致命错误,是把 Verilog 当成 C 语言来读——看到if (en) y = a; else y = b;就以为只是条件赋值,却没意识到综合器会把它实现为一个带使能端的 2 选 1 数据选择器(MUX),其关键路径延时直接受en到y的布线影响。这种认知偏差,是后续所有时序违例的源头。
2.1 从 always 块反推触发器类型:三步定位法
Verilog 中always块的敏感列表和内部结构,直接决定综合出的触发器行为。必须养成「见 always 先画图」的习惯:
// 示例1:同步复位D触发器(最常用) always @(posedge clk) begin if (rst_n == 1'b0) q <= 1'b0; else q <= d; end逻辑说明:
posedge clk表明这是边沿触发;if (rst_n==1'b0)在时钟上升沿采样复位信号,属于同步复位。综合器将生成一个标准 DFF,复位信号走 FF 的R端(非异步清零端)。
参数说明:rst_n必须是寄存器型(reg),且不能出现在@()敏感列表中——若误写为always @(posedge clk or negedge rst_n),则强制变为异步复位,时序分析模型彻底改变。
// 示例2:带异步复位和使能的DFF(需谨慎) always @(posedge clk or negedge rst_n) begin if (!rst_n) q <= 1'b0; else if (en) q <= d; end逻辑说明:
negedge rst_n强制综合器使用 FF 的异步清零端(CLR),该信号不受时钟控制,任何时刻拉低即清零。这会导致时序分析中出现recovery/removal time约束,极易违例。
参数说明:Xilinx UltraScale+ 中,异步复位路径的removal time要求通常比建立时间严苛 30%~50%,若rst_n由外部按钮输入且未做两级寄存器同步,上电瞬间必违例。
2.2 组合逻辑建模:case vs if-else 的门级差异可视化
多路选择场景下,case与if-else的综合结果在物理层面存在本质区别。这不是风格偏好问题,而是电路拓扑选择:
| 结构类型 | 综合出的典型电路 | 关键路径延时特征 | 适用场景 |
|---|---|---|---|
case语句(无优先级) | 并行 MUX 树:所有分支输入同时接入多路选择器阵列 | 延时 = 单级 MUX 延时 + 最长布线延时(与分支数无关) | 地址译码、状态机下一状态逻辑、无优先级编码器 |
if-else链(有优先级) | 串行比较链:先比if条件,不成立再比else if,逐级传递 | 延时 = N ×(比较器延时 + MUX 延时),N 为分支数 | 中断优先级仲裁、协议解析中的条件跳转 |
实操验证:在 Quartus Prime 18.1 中对 8 输入
case和if-else分别综合,查看 RTL Viewer 中的门级网表。case生成 3 层 2:1 MUX(深度 log₂8=3),而if-else生成 7 级串联比较器(第一级输出驱动第二级使能,依此类推)。当目标频率 > 100MHz 时,后者必然因组合路径过长而无法满足建立时间。
2.3 状态机建模:三段式为何是工业级底线?
新手常写两段式状态机(状态转移+输出),但大型项目必须用三段式(状态寄存器、下一状态逻辑、输出逻辑分离):
// 三段式核心结构(必须!) // 第一段:状态寄存器(纯时序) always @(posedge clk or negedge rst_n) begin if (!rst_n) state <= IDLE; else state <= next_state; end // 第二段:下一状态逻辑(纯组合) always @(*) begin case (state) IDLE: next_state = (start) ? RUN : IDLE; RUN: next_state = (done) ? IDLE : RUN; default: next_state = IDLE; endcase end // 第三段:输出逻辑(可时序可组合,推荐时序) always @(posedge clk or negedge rst_n) begin if (!rst_n) out <= 1'b0; else case (state) RUN: out <= 1'b1; default: out <= 1'b0; endcase end逻辑说明:第三段输出独立于状态转移,避免输出毛刺(glitch);且综合器能明确识别
out为寄存器输出,自动添加输出寄存器(Output Register),极大改善 IO 时序。
参数说明:若将输出写在第二段(组合逻辑),则out变成组合路径终点,其延时直接受state到out的布线长度影响,在高速接口中极易导致建立/保持时间违例。Xilinx UG903 明确建议:所有关键输出必须经寄存器打拍。
3. 组合逻辑优化:case 语句的并行度陷阱与 if-else 的隐性链式代价
组合逻辑是 FPGA 时序瓶颈的主战场。文档中强调「能用 case 就不用 if-else」,但真实工程中,这句话背后藏着三个必须亲手验证的硬约束:编码方式、default 覆盖、以及综合器对 case 的优化策略。忽略任一,所谓「并行」就会变成纸上谈兵。
3.1 full_case 与 parallel_case 综合指令:让综合器读懂你的意图
Verilog 标准本身不定义case的默认行为,综合器按安全原则处理未覆盖分支——这恰恰是性能杀手:
// 危险写法:未声明 full_case,综合器自动插入锁存器(latch) always @(*) begin case (sel) 2'b00: y = a; 2'b01: y = b; // 缺少 2'b10, 2'b11 分支! endcase end现象:综合报告中出现
Latch inferred for signal y,且时序分析显示y路径存在不定态反馈环。
原因:综合器认为sel=2'b10时y应保持原值,故生成锁存器。锁存器的使能端受sel控制,形成组合环,时序不可预测。
解决:强制声明full_case,告知综合器已穷举所有可能:
// 安全写法:显式覆盖 + full_case 指令 always @(*) begin case (sel) 2'b00: y = a; 2'b01: y = b; 2'b10: y = c; 2'b11: y = d; endcase end // 在 case 上方添加综合指令(Quartus) // synopsys full_case // 或 Xilinx 风格 // /* synthesis full_case */3.2 优先级编码器:if-else 是唯一正确解
当逻辑天然存在优先级(如中断请求仲裁),强行用case会制造灾难:
// 错误:用 case 实现优先级编码(综合器无视优先级!) always @(*) begin case ({irq3, irq2, irq1, irq0}) 4'b1xxx: priority = 3; // x 不代表 don't care,而是未定义! 4'b01xx: priority = 2; 4'b001x: priority = 1; 4'b0001: priority = 0; default: priority = 0; endcase end现象:
priority输出在irq3=0, irq2=1, irq1=1时可能为 2 或 1,取决于综合器对x的随机填充。
原因:case中的x是「无关项」(don't care),综合器会将其优化为最小化逻辑,但优先级关系被破坏。
解决:必须用if-else显式表达优先级,且每个条件必须可综合:
// 正确:if-else 链严格对应硬件优先级 always @(*) begin priority = 0; if (irq3) priority = 3; else if (irq2) priority = 2; else if (irq1) priority = 1; else if (irq0) priority = 0; end3.3 casez 与 casex:何时用「z」代替「x」?
casez(z 代表高阻)和casex(x/z 均代表无关)是处理总线地址译码的利器,但滥用会引入时序黑洞:
// 典型应用:32位地址总线译码(只关心高4位) wire [31:0] addr; reg [2:0] sel; always @(*) begin casez (addr[31:28]) 4'b100?: sel = 3'b001; // 匹配 1000 ~ 1001 4'b01??: sel = 3'b010; // 匹配 0100 ~ 0111 4'b001?: sel = 3'b011; // 匹配 0010 ~ 0011 default: sel = 3'b000; endcase end逻辑说明:
casez中?等价于z,综合器将其视为「不参与比较」,仅对指定比特位做精确匹配,生成的译码逻辑规模远小于完整 32 位比较。
参数说明:casex会将x也视为无关项,但若addr信号本身含x(如未初始化寄存器),可能导致意外匹配。工业级设计一律用casez,禁用casex。
提示:
casez生成的电路仍是并行结构,但「?」越多,实际门级电路越简化。实测表明,对 16 位地址用casez译码,比if-else链降低 40% LUT 使用量,且关键路径缩短 2.3ns(Artix-7 速度等级 -2)。
4. 数学思维降维:32bit乘法拆解背后的资源-时序平衡术
FPGA 资源(LUT、DSP、BRAM)与性能(频率、延时)永远在博弈。文档中那个 32×32 乘法拆解案例,绝非炫技,而是揭示一个核心法则:当 DSP Slice 不足时,用 LUT 换取时序余量,是比硬塞进 DSP 更优的工程解。但直接套用公式会翻车——必须理解拆解后的时序链如何重构。
4.1 Karatsuba 乘法的 FPGA 实现边界
32×32 拆为四个 16×16 乘法,本质是 Karatsuba 算法的特例。但 FPGA 上必须考虑三点:
- DSP Slice 分配冲突:Xilinx Artix-7 XC7A35T 仅有 90 个 DSP48E1,若设计中已有 FFT、FIR 等模块占用 60 个,则剩余 30 个不足以支撑 4 个并行 16×16(每个需 1 个 DSP)。
- 加法器链延时:拆解后需 3 个 32bit 加法器(
X1*Y1 <<32 + (X1*Y2 + X2*Y1) <<16 + X2*Y2),若用 Ripple Carry Adder,32bit 加法延时约 6.5ns(-2 速度等级),成为新瓶颈。 - 位宽对齐开销:
X1*Y1结果为 32bit,需左移 32 位(即补 32 个 0),在布线层面消耗大量 LUT。
实操方案:放弃全并行,改用「2 个 DSP + 1 个 LUT 加法器」混合架构:
// 用 DSP 计算 X1*Y1 和 X2*Y2(高精度部分) dsp_out1 = $signed(X1) * $signed(Y1); // 32bit result dsp_out2 = $signed(X2) * $signed(Y2); // 32bit result // 用 LUT 计算 X1*Y2 + X2*Y1(中等精度,允许舍入) lut_add = $signed(X1)*$signed(Y2) + $signed(X2)*$signed(Y1); // 最终结果 = dsp_out1<<32 + {lut_add,16'h0000} + dsp_out2
4.2 位运算替代乘法:查表法(LUT)的终极适用场景
当乘数为固定常数(如x * 10),绝对禁止用*运算符:
// 反模式:触发 DSP 使用 assign y = x * 10; // 正模式:用移位+加法(零 DSP 占用) assign y = (x << 3) + (x << 1); // x*8 + x*2 = x*10参数说明:
x << 3是逻辑左移,综合为布线连接,零延时;(x << 3) + (x << 1)仅需一个 32bit 加法器(若x为 32bit)。对比 DSP 方案,面积减少 95%,频率提升 15%(Vivado 2022.1,Kintex-7)。
4.3 浮点转定点:精度-资源的黄金分割点
文档未提浮点,但工程中常遇float运算需求。FPGA 天然适合定点,关键在 Q 格式选择:
| 数据范围 | 推荐 Q 格式 | 优势 | 风险 |
|---|---|---|---|
| -1.0 ~ +1.0 | Q1.15(1 符号位+1 整数位+15 小数位) | 小数精度达 3e-5,乘法结果可直接截断 | 整数溢出风险高(>1 即饱和) |
| -100 ~ +100 | Q8.24 | 整数位充足,小数精度 5.96e-8 | LUT 使用量激增(24bit 加法器比 15bit 多 3.2 倍) |
血泪经验:某图像处理项目用 Q16.16 处理 RGB 像素,结果在 gamma 校正环节因中间值溢出导致全屏噪点。最终改为 Q12.20,整数位保 12bit(>4095),小数位 20bit(精度 9.5e-7),资源增加 18%,但时序收敛且无溢出。
注意:Q 格式转换必须在数据入口/出口做显式缩放。例如 ADC 采样值 0~4095(12bit),要转 Q12.20,需
fixed_val = adc_val << 20;输出前需adc_val = fixed_val >> 20。漏掉任一移位,精度全毁。
5. 时钟域交叉(CDC):从「心脏比喻」到 metastability 的物理实证
文档说「时钟是时序电路的控制者」,但真正致命的是——当两个时钟域的数据握手失败时,你面对的不是逻辑错误,而是亚稳态(metastability)引发的物理层混沌。这不是理论,是示波器上真实捕获到的 nanosecond 级电压平台,它会让 FPGA 在 0.1 秒内随机重启三次。
5.1 亚稳态的量化指标:MTBF(平均无故障时间)
亚稳态无法消除,只能降低概率。MTBF 计算公式为:
MTBF = e^(t_res / τ) / (f_clk * f_data * T0)其中t_res为同步器恢复时间(通常取 2 个时钟周期),τ为器件固有参数(Xilinx Kintex-7 约 0.3ns),T0为工艺相关常数(约 0.001)。代入f_clk=100MHz,f_data=1MHz,单级同步器 MTBF ≈ 0.3 秒 —— 这意味着平均每秒就有一起亚稳态事件!
解决方案:必须用两级(或三级)寄存器同步:
// 跨时钟域信号同步(源时钟 clk_a,目的时钟 clk_b) reg [1:0] sync_reg; always @(posedge clk_b) begin sync_reg[0] <= async_signal; // 第一级:捕获可能亚稳态 sync_reg[1] <= sync_reg[0]; // 第二级:等待亚稳态退出 end assign synced_signal = sync_reg[1];逻辑说明:第一级寄存器可能进入亚稳态(输出既非 0 也非 1),但第二级在下一个
clk_b上升沿采样时,亚稳态已以极高概率退出,输出稳定值。
参数说明:Xilinx UG903 规定,对clk_b=100MHz,两级同步器 MTBF > 10^9 秒(>31 年),满足工业级要求。
5.2 FIFO 乒乓操作:不只是「双缓冲」,而是时钟域隔离的物理实现
文档中 eMMC 烧写案例的精髓,在于用异步 FIFO 将 MCU(APB 总线,~50MHz)与 FPGA 内部高速逻辑(200MHz)彻底隔离:
// 异步 FIFO 核心参数(Xilinx FIFO Generator v13.2) // Write Clock: clk_mcu (50MHz) // Read Clock: clk_fpga (200MHz) // Data Width: 8 bit // Depth: 1024 entries // Reset Type: Asynchronous (separate rst for wr/rd)避坑 / 常见问题 / 排查
现象1:FIFOfull信号在wr_en有效时未及时置高,导致数据覆盖
原因:wr_full是wr_clk域信号,但被误接至rd_clk域逻辑判断。跨时钟域信号未同步。
解决:wr_full必须经两级同步器送入rd_clk域,或直接使用 FIFO IP 核提供的wr_full_sync同步版本。现象2:
rd_data读出数据错乱,高位字节总是 0xFF
原因:rd_en使能信号由rd_clk域逻辑产生,但未对rd_valid(wr_clk域信号)做同步,导致rd_en在rd_valid无效时误读。
解决:rd_valid必须同步至rd_clk域,且rd_en只在同步后的rd_valid_sync为高时拉高。现象3:系统运行 10 分钟后 FIFO 指针错乱,
wr_ptr与rd_ptr差值非 0/1024
原因:异步 FIFO 的格雷码指针(gray code pointer)在跨时钟域采样时,因多位同时变化导致采样错误(如3'b011→3'b100,中间态3'b111被采样)。
解决:FIFO IP 核必须启用Use Gray Code Pointers选项(默认开启),确保指针每次只变 1bit。
5.3 时钟约束文件(XDC)的生死线:3 行代码决定能否上板
所有 CDC 设计的前提,是时钟约束正确。以下 XDC 片段是某项目成功的关键:
# 创建主时钟(FPGA 外部晶振输入) create_clock -name clk_100m -period 10.000 -waveform {0 5} [get_ports clk_in] # 创建衍生时钟(MMCM 输出,相位偏移 90°) create_generated_clock -name clk_100m_90 -source [get_pins clk_mmcm/CLKIN1] \ -divide_by 1 -multiply_by 1 -phase 90.0 [get_pins clk_mmcm/CLKOUT0] # 声明异步时钟组(告诉工具:这些时钟域间无需时序分析!) set_clock_groups -asynchronous -group [get_clocks clk_100m] \ -group [get_clocks clk_mcu]逻辑说明:最后一行
set_clock_groups是 CDC 的法律文书——它禁止工具对clk_100m和clk_mcu之间的路径做时序检查,否则工具会疯狂报unconstrained path错误,且无法收敛。
参数说明:若忘记此行,Vivado 会尝试对跨时钟域路径做建立/保持分析,因缺乏公共参考点而失败,综合后逻辑可能正常,但布局布线阶段直接报错退出。
6. IP 核调用铁律:从「省事」到「可控」的七道校验工序
文档说「能用 IP 核就别自己写」,但真实世界里,IP 核是双刃剑:用得好,效率翻倍;用得糙,debug 成本是手写逻辑的 10 倍。我见过太多团队因盲目信任 IP 核默认配置,在量产前一周发现 AXI 协议握手中READY信号延迟超标,被迫重做整个 SoC 封装。以下是我在某跨平台系统中沉淀的 IP 核调用七道校验工序,每一道都是用板级信号实测过的。
6.1 校验工序表:IP 核交付前的必过七关
| 工序 | 检查项 | 工具/方法 | 不通过后果 | 实测耗时 |
|---|---|---|---|---|
| 1. 参数一致性 | IP 核 GUI 中设置的DATA_WIDTH=32,是否与顶层模块端口声明output logic [31:0] data_out严格一致? | 文本搜索 + Vivado IP Catalog 对比 | 综合时报port width mismatch,或静默截断高位 | 2 分钟 |
| 2. 时钟域声明 | AXI Stream IP 的aclk是否已正确关联至create_clock约束?aresetn是否绑定至复位网络? | Tcl Console 执行report_clock_networks | 时序分析缺失,aclk被识别为no_clock,关键路径无约束 | 5 分钟 |
| 3. 复位同步性 | IP 核内部复位是否与系统复位同源?若 IP 核自带resetn输入,是否已连接至全局同步复位树? | RTL Schematic 查看复位扇出 | 复位释放不同步,IP 核内部状态机卡死在RESET状态 | 10 分钟 |
| 4. 握手时序实测 | tvalid与tready之间是否存在反压导致的tlast错位?用 ILA 抓取连续 1000 个包的tvalid/tready时序 | ChipScope/ILA 抓波形 | 数据包被截断或重复,上位机接收乱码 | 30 分钟 |
| 5. 资源占用审计 | IP 核报告的 LUT/FF/DSP 使用量,是否超过芯片剩余资源的 70%?尤其关注 BRAM Block RAM 的RAMB18/36分配 | report_utilization -hierarchical | 布局布线失败(ERROR: [Place 30-600]),无法生成 bitstream | 3 分钟 |
| 6. 时序例外标注 | IP 核内部跨时钟域路径(如 AXI-Lite 寄存器桥)是否已添加set_false_path? | report_timing_summary -delay_type min_max查看Unconstrained Paths | 时序报告充斥虚假违例,掩盖真实瓶颈 | 8 分钟 |
| 7. 回环测试验证 | 构建最小闭环:IP 核输出直连输入(如 FIFOrd_data→wr_data),注入已知序列,验证输出序列完整性 | Python 脚本比对发送/接收序列 | IP 核逻辑错误(如地址指针错乱),功能级失效 | 15 分钟 |
6.2 AXI Stream FIFO 的魔鬼细节:tlast 与 tuser 的时序耦合
AXI Stream 协议中,tlast(数据包结束标志)和tuser(用户自定义字段)的时序关系常被忽视:
// 危险:tlast 与 tdata 不在同一周期有效 always @(posedge aclk) begin if (wr_en) begin wr_data <= data_in; wr_last <= (cnt == PKT_LEN-1); // tlast 晚于 tdata 一拍 end end现象:接收端看到
tvalid=1, tlast=0后,下一拍tvalid=0, tlast=1,协议解析器误判为「空包」。
原因:AXI Stream 协议要求tlast必须与对应tdata在同一tvalid=1周期有效。
解决:tlast必须与tdata同步寄存,且tvalid使能时二者同时更新:always @(posedge aclk) begin if (wr_en) begin wr_data <= data_in; wr_last <= (cnt == PKT_LEN-1); // 与 wr_data 同周期更新 wr_valid <= 1'b1; end else wr_valid <= 1'b0; end
6.3 自定义 IP 核封装:从「黑匣子」到「透明模块」的封装规范
当必须自研 IP(如定制 CRC 计算器),封装时必须遵守三项铁律:
- 端口命名强制标准化:
s_axis_tdata,s_axis_tvalid,m_axis_tdata,m_axis_tready—— 与 Xilinx AXI IP 保持一致,避免信号名混淆。 - 复位必须异步低电平:
aresetn输入,内部所有寄存器均用always @(posedge aclk or negedge aresetn),确保与系统复位树兼容。 - 必须提供
.xci封装文件:用 VivadoCreate and Package New IP向导生成,包含完整约束、仿真模型、文档。禁止直接扔.v文件进工程。
**从那以后我每次调用 IP 核,都强制走一遍这七道工序——哪怕只是一个 8bit 计数器 IP。因为 2018 年那个 AXI DMA 项目,我们就在第六道工序(时序例外)漏掉了一条
set_false_path,导致量产前发现s_axi_awready延时超标 0.8ns,不得不返工重做 PCB。希望帮到你。
本文还有配套的精品资源,点击获取