news 2026/10/16 7:35:30

自编AXI4 Slave核与XDMA对接实战:握手协议、位宽匹配与调试避坑

作者头像

张小明

前端开发工程师

1.2k 24
文章封面图
自编AXI4 Slave核与XDMA对接实战:握手协议、位宽匹配与调试避坑

简介:本资源面向FPGA与PCIe驱动开发的中高级工程师,聚焦XDMA核与AXI4协议数据读写链路中的接口转换环节,提供自编AXI4Slave核的完整实现方案,解决AXI4事务与AXI-stream连续数据流之间的协议适配问题。压缩包共15个文件,约25KB,以tcl脚本、Verilog源码、C驱动与头文件为主,另含mdd、makefile、sv与xml等,覆盖IP打包、综合仿真、驱动示例与硬件设计等用途,目录结构清晰便于按模块查阅。目前已有5190人学习下载。读者可从中获取AXI4Slave核的Verilog实现思路,理解数据宽度匹配、事务同步、流控制信号生成、错误响应与FIFO缓冲等关键设计点,并借助配套脚本与测试平台完成仿真验证和集成调试,适合作为PCIe高速数据采集与传输项目的参考模板。

1. 自编 AXI4 Slave 核:为什么现成 IP 核反而会拖慢你的调试节奏

很多人第一次做 PCIe 数据读写,直觉是「XDMA 核都给了 AXI4 接口,那我直接挂个现成 AXI4 Slave IP 不就行了」。但真正跑过一轮回环测试的人会发现,问题往往不出在 PCIe 链路上,而是出在那个「看起来最不该出问题」的 AXI4 Slave 上——握手信号卡死、写响应迟迟不回、读数据通道和地址通道对不上号。原因很简单:XDMA 暴露出来的 AXI4 接口是一套带完整握手语义的总线协议,而现成 IP 核为了通用性塞进了大量你用不到的仲裁、缓冲和可配置逻辑,一旦时序或位宽对不上,你连波形都看不懂。自编一个 AXI4 Slave 核的价值不在于「造轮子」,而在于你完全掌控每一个 valid/ready 的拉高时机,能把 PCIe 读写这条链路从主机内存到 FPGA 内部寄存器的每一拍都摊在波形上。这篇就拆解这套自编核的底层机制:AXI4 的握手为什么这么设计、写通道和读通道的状态机怎么收敛、以及和 XDMA 对接时哪些参数是「改一个就翻车」的硬约束。

2. AXI4 握手协议:valid/ready 为什么不能随便拉高

2.1 五通道分离的本质是解耦

AXI4 把一次传输拆成五个独立通道:写地址 AW、写数据 W、写响应 B、读地址 AR、读数据 R。每个通道都有自己的 valid 和 ready 信号,传输发生的条件是「valid 和 ready 在同一拍同时为高」。这个设计的动机不是增加复杂度,而是让地址、数据、响应可以各自流水,主设备不必等数据准备好才发地址,从设备也不必等响应发完才收下一笔地址。

常见的实现思路是:把每个通道当成一条独立的 FIFO 边界,valid 表示「我这边有货」,ready 表示「我这边能收货」,两者握手成功才完成一次搬运。这里最容易踩的坑是「valid 不能等 ready 才拉高」——协议规定 valid 一旦拉高就必须保持到握手完成,不能因为看到 ready 没来就撤掉。很多自编核第一次跑不通,就是状态机里把 valid 写成了组合逻辑依赖 ready,导致 XDMA 侧看到 valid 抖动,直接判定协议违例。

2.2 写通道的状态机收敛

写通道要处理 AW 和 W 两个通道的到达顺序问题。AXI4 允许写地址先到、写数据先到、或者同时到,从设备必须都能接。一个稳妥的状态机是四态:IDLE 等 AW 或 W,AW_GOT 表示地址已收等数据,W_GOT 表示数据已收等地址,B_SEND 表示数据齐了发写响应。

// 写通道状态机核心片段 localparam IDLE = 2'd0; localparam AW_GOT = 2'd1; localparam W_GOT = 2'd2; localparam B_SEND = 2'd3; always @(posedge clk or negedge rst_n) begin if (!rst_n) begin state <= IDLE; aw_valid_r <= 1'b0; w_valid_r <= 1'b0; end else begin case (state) IDLE: begin // 地址和数据谁先到都接,分别锁存 if (aw_valid && aw_ready) begin aw_addr_r <= aw_addr; state <= W_GOT; // 地址先到,等数据 end else if (w_valid && w_ready) begin w_data_r <= w_data; state <= AW_GOT; // 数据先到,等地址 end end AW_GOT: begin // 已有数据,等地址 if (aw_valid && aw_ready) begin aw_addr_r <= aw_addr; state <= B_SEND; end end W_GOT: begin // 已有地址,等数据 if (w_valid && w_ready) begin w_data_r <= w_data; state <= B_SEND; end end B_SEND: begin // 写响应必须等 bready 握手后才算完成 if (b_valid && b_ready) begin state <= IDLE; end end endcase end end

这段状态机的关键点是:AW 和 W 的 ready 信号在对应状态下才拉高,避免从设备在没准备好时误收。B_SEND 态里 bvalid 拉高后必须等 bready,不能自己撤。参数上,aw_addr 的位宽要和 XDMA 配置的地址位宽一致,常见是 32 位或 64 位,改错一位整个地址映射就偏了。

2.3 读通道的数据对齐

读通道相对简单,AR 收到后从设备把数据放到 R 通道,rlast 标记最后一拍。但要注意 rvalid 不能依赖 arready,因为 AR 握手完成后从设备可能还没准备好数据,这时 rvalid 保持低电平即可,等数据就绪再拉高。读数据位宽必须和 XDMA 侧配置的数据位宽严格一致,64 位对 32 位这种错配会导致 XDMA 直接丢包。

3. 和 XDMA 对接:位宽、地址、时序的三重约束

3.1 位宽匹配是硬约束

XDMA 核在 IP 配置阶段会让你选 AXI4 数据位宽,常见选项是 64 位、128 位、256 位、512 位。这个位宽决定了 AXI4 接口上 wdata 和 rdata 的宽度,自编 Slave 核必须完全一致。我一般会这么理解:XDMA 内部把 PCIe 的 TLP 包拆成 AXI4 的 burst 传输,位宽就是它拆包的粒度,你这边位宽对不上,它拆出来的数据你就拼不回去。

地址位宽同理,XDMA 的 AXI4 地址位宽通常和 PCIe BAR 的映射范围相关,配置成 32 位时最大寻址 4GB,64 位时更大。自编核的地址寄存器位宽要跟着走,否则高位地址被截断,主机读写就会落到错误的偏移上。

3.2 时序收敛:为什么你的核跑不到 250MHz

XDMA 的 AXI4 接口通常要求跑在 250MHz 或更高,自编核能不能收敛到这个频率,取决于关键路径。写通道里 aw_addr_r 到状态判断再到 ready 输出,如果组合逻辑太长,时序就崩。常见的优化是把状态判断和输出打一拍,用寄存器输出代替组合输出,代价是增加一拍延迟,但换来频率提升。

// 寄存器输出示例:把 ready 打一拍 always @(posedge clk or negedge rst_n) begin if (!rst_n) begin aw_ready_r <= 1'b0; end else begin // 次态决定下一拍的 ready,切断组合路径 aw_ready_r <= (state == IDLE) || (state == W_GOT); end end assign aw_ready = aw_ready_r;

这段代码把 aw_ready 从组合逻辑改成寄存器输出,关键路径从「状态译码 + 输出」缩短为「状态译码」,频率能明显往上走。参数上,如果 XDMA 配置的是 250MHz,综合工具报的 WNS 为负,优先检查这类组合路径。

3.3 复位和时钟域

XDMA 输出的 axi_aclk 和 axi_aresetn 是自编核的唯一时钟复位源,不要自己再生成一个时钟去采样 AXI4 信号,否则跨时钟域问题会让你调到时序全乱。复位要同步释放,异步复位同步释放是标准做法,避免复位撤除时状态机进入亚稳态。

4. 避坑与排查:自编 AXI4 Slave 核最常见的五个翻车点

4.1 现象:写响应永远不回,主机侧超时

原因:B_SEND 态里 bvalid 拉高后,bready 一直不来,或者 bvalid 被组合逻辑误撤。XDMA 侧如果没收到写响应,会一直等,主机驱动报超时。

解决:用波形确认 bvalid 拉高后是否保持到 bready 为高,检查 bvalid 是否被其他条件意外清零。bresp 要固定为 2'b00 表示 OKAY,除非你真的要报错。

4.2 现象:读数据错位,主机读到的值和写入的不一样

原因:rdata 的位宽和 XDMA 配置不一致,或者 rlast 拉高的时机不对,导致 XDMA 拼包时多拼或少拼了一拍。

解决:核对 XDMA IP 配置里的 AXI4 数据位宽,确认 rdata 位宽一致;用波形数 rlast 之前的 rvalid 拍数,应该等于 burst 长度。

4.3 现象:地址偏移错乱,读写落到错误寄存器

原因:aw_addr 或 ar_addr 的位宽被截断,高位丢失。比如 XDMA 发的是 64 位地址,自编核只接了低 32 位。

解决:检查地址寄存器位宽和 XDMA 配置是否一致,综合工具是否有位宽不匹配的 warning。

4.4 现象:时序不收敛,频率跑不到目标值

原因:valid/ready 的组合逻辑路径太长,或者状态机译码逻辑太复杂。

解决:把 ready 和 valid 改成寄存器输出,切断组合路径;简化状态译码,用独热码或格雷码减少组合深度。

4.5 现象:复位后状态机卡死,波形上状态不变

原因:复位释放时没有同步,状态机进入亚稳态后停在非法状态。

解决:用异步复位同步释放电路,确保复位撤除沿和时钟对齐;状态机加 default 分支,非法状态自动回 IDLE。

5. 设计取舍:自编核的边界在哪里

自编 AXI4 Slave 核最大的价值是可控性,但它的边界也很清楚:它适合寄存器级读写、小批量数据搬运、以及需要精确控制每一拍时序的调试场景。如果你要做大带宽的 DMA 流式传输,自编核的 FIFO 深度和缓冲策略很难拼过 XDMA 自带的 AXI4 接口优化,这时候更合理的做法是用 XDMA 的 AXI4-Stream 接口配合自编的流处理逻辑,而不是硬扛 AXI4 的握手开销。

另一个取舍是位宽和频率的平衡。位宽越宽,单拍搬运的数据越多,但布线资源和时序压力也越大。我一般会这么理解:250MHz 下 64 位位宽的有效带宽约 2GB/s,128 位约 4GB/s,但能不能收敛到 250MHz 取决于你的逻辑深度。如果时序实在收不住,降频到 200MHz 换 128 位位宽,总带宽可能反而更高。

验证方法上,建议先用一个简单的回环测试:主机写一个已知 pattern 到自编核的寄存器,再读回来比对。波形上重点看 AW、W、B 三个通道的握手顺序,以及 AR、R 的对应关系。如果回环通了,再上真实数据流。

从那以后我每次对接 XDMA 和自编 AXI4 Slave,都强制先跑一遍单寄存器回环,确认五个通道的握手波形干净,再往上叠逻辑。这个习惯帮我省掉了至少三次「以为是 PCIe 链路问题、结果是 AXI4 握手违例」的深夜调试。希望帮到你。

本文还有配套的精品资源,点击获取

版权声明: 本文来自互联网用户投稿,该文观点仅代表作者本人,不代表本站立场。本站仅提供信息存储空间服务,不拥有所有权,不承担相关法律责任。如若内容造成侵权/违法违规/事实不符,请联系邮箱:809451989@qq.com进行投诉反馈,一经查实,立即删除!
网站建设 2026/10/16 7:35:20

代码补全RAG:一行Grep检索为何反超复杂图检索?

如果你做代码补全或者 RAG&#xff08;检索增强生成&#xff09;的应用&#xff0c;肯定见识过检索器领域的“军备竞赛”&#xff1a;知识图谱、代码依赖图、AST 子树索引、数据流分析……似乎检索器不做得足够复杂&#xff0c;就不配叫 RAG。但最近我看到一篇研究代码补全检索…

作者头像 李华
网站建设 2026/10/16 7:35:02

本地开源AI 3D模型闭合网格修复与游戏资产转换工作流

1. 项目概述&#xff1a;为什么“能用了”这三个字值得单独强调&#xff1f;“3D AI模型终于能用了&#xff01;”——这句话不是营销话术&#xff0c;而是过去半年里我反复在本地工作站上敲下回车键后&#xff0c;真实发出的感叹。它背后藏着一个被严重低估的现实&#xff1a;…

作者头像 李华
网站建设 2026/10/16 7:34:59

大模型创业生存指南:钱烧在哪,怎么活下来?

"假设你开了一家大模型公司&#xff1a;钱烧在哪&#xff1f;该怎么活下来&#xff1f;"这话题我琢磨了很久。身边不少朋友聊起大模型创业&#xff0c;开口就是"我们训一个XX亿参数的模型"&#xff0c;闭口就是"AGI不远了"&#xff0c;但一问到每…

作者头像 李华
网站建设 2026/10/16 7:34:06

HAL库DHT11温湿度传感器+OLED显示:零基础入门实战

简介&#xff1a;这份资源面向嵌入式与物联网方向的初学者及开发者&#xff0c;提供基于STM32 HAL库驱动DHT11温湿度传感器并在OLED屏上实时显示数据的完整工程实例&#xff0c;可用于智能家居、环境监测等场景的入门实践与课程设计参考。压缩包共193个文件&#xff0c;约6.9MB…

作者头像 李华
网站建设 2026/10/16 7:34:04

微信小程序分享体系全解析:转发、收藏与朋友圈实现指南

/* MD / 富文本中的 .toc(含博客园搬家等嵌套结构);.toc-box 在侧栏,不受影响 */#content_views .toc,/* 编辑器常在目录前后插入空 p(:empty 仍占 20px),一并去掉避免顶空隙 */#content_views.markdown_views > p:empty:has(+ .toc),#content_views.markdown_views …

作者头像 李华
网站建设 2026/10/16 7:33:50

两串电池均衡实战:MP2642GR-Z前端与STM32F746VG主控的储能备电方案

/* MD / 富文本中的 .toc(含博客园搬家等嵌套结构);.toc-box 在侧栏,不受影响 */#content_views .toc,/* 编辑器常在目录前后插入空 p(:empty 仍占 20px),一并去掉避免顶空隙 */#content_views.markdown_views > p:empty:has(+ .toc),#content_views.markdown_views …

作者头像 李华