news 2026/10/29 16:09:41

AHB协议实战:流水线结构、突发传输与从机设计

作者头像

张小明

前端开发工程师

1.2k 24
文章封面图
AHB协议实战:流水线结构、突发传输与从机设计

1. 先想清楚AHB为什么非要把一次传输劈成两拍

第一次看AHB协议时序图的人,十有八九会有一个疑问:明明一次读写就那么点事,为什么非要拆成两个相位、中间还夹个HREADY?我最早接触这套总线的时候,也觉得这是"为了复杂而复杂"。直到我自己动手写从机、跑仿真、看波形,把一次传输从头到尾走了一遍,才明白这套结构不是设计者拍脑袋想出来的,而是被"流水线"和"突发传输"这两个目标硬生生逼出来的。AHB协议实战里踩过的坑,有一半都能追溯到对这两个字理解不到位。

我先把话说在前面:这篇内容不讲"AHB是什么"这种百科式的东西,而是站在实际写RTL、调波形、做验证的角度,把AHB的流水线结构和突发传输机制拆开讲透,告诉你每一根信号为什么长这样、什么时候必须这样、不这样会出什么问题。适合已经看过协议手册但一看就困、或者代码写完了仿真跑不通的读者。如果你是刚入门数字前端的新人,建议先把最基本的握手概念过一遍再来;如果你已经做过几个AHB从机项目,这篇文章里的边界计算和异常响应部分应该有你能直接拿去用的东西。

1.1 地址相位与数据相位分离的真实动机

AHB把一次传输切成两个阶段:地址相位(Address Phase)和数据相位(Data Phase)。地址相位里,主机把HADDR、HTRANS、HWRITE、HSIZE、HBURST这些控制信息摆上总线;数据相位里,写操作主机给出HWDATA,读操作从机给出HRDATA。一个相位占一个HCLK周期。

这么做最直接的好处是:总线上的控制通路和数据通路可以同时工作。地址相位在前,数据相位在后,当第N次传输的数据相位正在进行时,第N+1次传输的地址相位已经可以摆上来了。也就是说,总线在同一时刻同时在处理"上一次的数据"和"这一次的地址"。这跟工厂流水线一个道理:工位A在拧螺丝,工位B在装外壳,两个工位同时干活,整体吞吐率才能上去。

如果不用流水线,一次传输必须等数据全部送完才能开始下一次的地址,那么总线每个传输都要花两拍甚至更多,吞吐率直接砍半。对于当年那些跑在几十兆赫兹、但要求高带宽的嵌入式系统来说,这个差距是致命的。所以AHB的设计目标从一开始就很明确:用结构上的复杂度换取吞吐率。

但流水线是有代价的。代价就是时序上的耦合:第N次传输的数据相位能不能顺利结束,取决于第N+1次传输的地址相位有没有准备好;而从机能不能接收第N+1次的地址,又取决于它当前数据相位处理完没有。这个"互相牵制"的关系,全部压在HREADY这根信号上。理解了这一点,后面所有关于等待周期、突发延展的内容就都顺了。

1.2 流水线带来的"重叠"到底重叠了什么

我见过不少人在写从机的时候,把地址相位和数据相位当成完全独立的两件事来处理,结果就是——单次传输能跑通,一上突发就全乱。问题出在哪?出在他们没意识到这两个相位是同一条时间轴上的相邻两拍,且共用同一套状态。

具体来说,在一个理想的无等待传输中:

  • 第1拍(地址相位):主机给出HADDR、HTRANS=NONSEQ、HWRITE等,从机在HCLK上升沿采样。
  • 第2拍(数据相位):主机给出HWDATA(写)或从机给出HRDATA(读),同时主机已经在地址相位摆出下一次传输的地址。

注意第2拍这个时刻,总线上的HADDR已经变成了下一次传输的地址,而不是当前这次。很多新手写从机时,看到HADDR变了就以为出错了,其实这是完全正常的。从机必须在第1拍把地址锁下来,第2拍用锁存的地址去访问内部寄存器。如果你在第2拍还去直接看HADDR,那你拿到的是下一个地址,读出来的数据自然是错的——这是我在实际项目里见过的最高频的错误之一。

再叠一层:如果从机在第2拍无法完成数据交换(比如内部SRAM要等一个周期),它就把HREADYOUT拉低,此时整个总线被"冻住"——地址相位保持不变,主机也不能推进到下一次传输。这个冻结是全局的,不只是影响当前从机,而是影响挂在这条总线上的所有设备。这就是为什么AHB的等待周期设计要格外谨慎:你多插一拍,整条总线的吞吐率就掉一截。

1.3 单周期握手与流水线结构的取舍对比

有人会问,既然流水线这么麻烦,为什么不干脆用简单的"请求-应答"两相握手?我用一张表把这笔账算清楚,各位自己判断。

对比维度单周期握手(无流水)AHB两相流水
单次传输耗时地址+数据串行,至少2拍稳态下平均1拍/次
控制逻辑复杂度低,状态少高,需处理相位重叠
从机设计难度低,直接响应即可中高,需锁存地址相位
突发传输效率每次都要重新发地址突发内地址自增,效率高
时序收敛压力小大,组合路径经过HREADY
调试难度波形直观波形需要对照相位理解

从表里能看出来,AHB是在"效率"和"复杂度"之间做了一次明确的取舍:它选择了效率,把复杂度甩给了设计者。这也是为什么AHB的从机代码看起来比SPI、I2C这类总线的从机复杂得多——不是因为协议设计得不好,而是因为它把流水线的收益做到了极致,代价就是你必须理解流水线。

还有一点容易被忽略:AHB的流水线结构对时序收敛提出了额外要求。HREADY这根信号要从从机出发,经过多路选择器回到主机,路径上可能串了好几级逻辑。如果这条路径太长,整个总线的主频就上不去。所以实际项目里,HREADY路径往往是要重点优化的对象,必要时得插入寄存器打拍(这会引入额外延迟,需要协议层面配合)。这个权衡在后面的时序章节我会细说。

2. 一个读传输从HSEL拉高到HRDATA采样的完整时序链条

光讲结构太虚,我把一次完整的读传输拆成时钟拍来走一遍。这一段是整篇的基础,后面讲突发、讲异常响应,用的都是同一套时序语言。如果你能把这一节的时序在脑子里跑通,剩下的内容基本就是在这套骨架上加分支。

2.1 控制相位的采样时刻:谁在时钟沿看什么

AHB的采样规则很简单但很多人记不住:所有信号都在HCLK的上升沿被采样,且采样的前提是HREADY为高。这句话有两个要点,一是"上升沿",二是"HREADY为高"。

在地址相位这一拍,主机摆出:

  • HSEL:选中目标从机,由地址译码器产生
  • HADDR:32位地址
  • HTRANS:传输类型,NONSEQ表示一次新传输的开始,SEQ表示突发中的后续拍,IDLE表示空闲,BUSY表示主机忙但不推进
  • HWRITE:1为写,0为读
  • HSIZE:传输宽度,3位编码,从8位到1024位
  • HBURST:突发类型
  • HPROT:保护属性,实际项目里经常被忽略

从机在上升沿看到HSEL和HREADY同时为高、且HTRANS为NONSEQ或SEQ,就认为"有一次合法传输的地址相位被采到了",此时必须把HADDR、HWRITE、HSIZE等锁进寄存器。注意这里是锁存,不是立即使用。因为下一拍地址就变了。

我这里插一句实操经验:写从机代码的时候,地址锁存的条件判断一定要写完整,不能只写hsel && hready。因为HTRANS可能是IDLE,这时候地址是无效的,你锁进去就是垃圾数据。我见过有人因为这个漏判,在空闲周期之后的第一笔传输读到上一次的残留地址,查了两天才找到原因。

2.2 HREADY如何把一次传输"拉长"成多拍

HREADY是AHB里唯一一根"全局节奏控制"信号,它的作用可以粗暴理解为:只要它为低,整个总线就停在当前拍不动。

从机的输出叫HREADYOUT,所有从机的HREADYOUT经过一个多路选择器(由HSEL决定选谁),汇成全局的HREADY,再回送给主机。这个结构意味着:只要有一个从机把HREADYOUT拉低,全局HREADY就是低,主机就被迫等待。

一个典型的等待场景是这样走的:

  • 第1拍:地址相位,HREADY为高,从机锁存地址
  • 第2拍:数据相位开始,但从机内部还没准备好数据,HREADYOUT拉低
  • 第2拍继续(还是同一个时钟拍):HREADY为低,主机保持所有信号不变
  • 第3拍:从机数据准备好,HREADYOUT拉高,HRDATA被采样
  • 第4拍:正常推进到下一次传输

注意第2拍和第3拍其实是"同一次数据相位被拆成了两拍",地址相位并没有重新发。这就是HREADY的核心作用:延展数据相位,而不是延展地址相位。地址相位在HREADY为高的那一拍就已经结束了,锁存好的地址在整个等待期间保持不变。

这里有个细节很多人搞混:在等待周期里,HADDR会保持住不变,看起来像是"地址相位还在继续",其实不是,那只是因为主机在HREADY为低时不推进,所以信号自然保持在原值。理解这一点后,你在波形上看到地址不变就知道是等待,而不是又发了一次地址。

2.3 从机的零等待与等待插入设计

从机要不要插等待,取决于它内部的处理延迟。我把常见的几类从机列一下:

从机类型典型延迟是否插等待设计要点
纯组合逻辑寄存器组0拍不插HREADYOUT恒高
单口SRAM(同步读)1拍插1拍读数据相位延展
外设寄存器(有副作用)视情况可能插注意别重复触发
跨时钟域桥多拍插多拍需处理异步握手

零等待从机是最省事的,HREADYOUT直接接1'b1,所有传输一拍完成。但零等待的前提是你内部逻辑真的能在一个周期内出数据。如果是同步读SRAM,读地址给进去,数据要到下一个上升沿才出来,那从机就必须在数据相位插一拍等待,否则主机会采到旧数据。

这里有个经常被忽视的坑:插等待时,HRDATA的驱动时机。如果你在等待期间就让HRDATA变化,而HREADY还是低,理论上主机不会采样,但很多仿真模型的断言会报错,而且如果后端综合出毛刺,可能引发误采样。稳妥做法是等HREADYOUT拉高的那一拍,HRDATA才稳定输出。

还有一个更隐蔽的问题:写传输的HWDATA。写操作时主机在数据相位给出HWDATA,如果从机插了等待,主机必须在整个等待期间保持HWDATA不变。这一点协议里写得很清楚,但如果你自己写主机模型,忘了保持,从机就可能写进错误的数据。双向都要守规矩,总线才能正常工作。

3. HBURST编码背后的边界计算与回绕逻辑

突发传输是AHB效率的来源,也是坑最多的地方。单次传输跑通容易,突发跑通难,难就难在地址推进和边界约束这两件事上。这一节我把HBURST的八种编码掰开,重点讲清楚WRAP的回绕怎么算、1KB边界为什么存在。

3.1 固定长度突发的四种长度与地址递增

HBURST是3位编码,对应8种类型:

HBURST类型传输次数地址行为
3'b000SINGLE1不递增
3'b001INCR未定义每拍递增
3'b010WRAP44递增到边界后回绕
3'b011INCR44每拍递增
3'b100WRAP88递增到边界后回绕
3'b101INCR88每拍递增
3'b110WRAP1616递增到边界后回绕
3'b111INCR1616每拍递增

INCR是个"未定义长度"类型,主机可以随时用IDLE或NONSEQ结束它,长度不受限制,但同样不能跨1KB边界。固定长度突发(INCR4/8/16)的好处是从机可以提前知道要收多少拍,做流水线优化;WRAP则主要用于cache行填充这类场景。

地址递增的步长由HSIZE决定:HSIZE=3'b000是1字节,001是2字节,010是4字节……一直到3'b111是1024位即128字节。递增时是字节地址递增,不是"第几个元素"递增。比如HSIZE=2(4字节)、INCR4,起始地址0x1000,地址序列是0x1000、0x1004、0x1008、0x100C。这个不难,但初学者常在HSIZE与地址对齐上翻车——协议规定传输地址必须对齐到HSIZE对应的边界,0x1002配HSIZE=2就是非法配置,严格的从机会报ERROR。

3.2 WRAP突发的回绕机制与地址掩码计算

WRAP是真正需要动笔算的地方。它的规则是:突发长度固定,起始地址不一定是突发的起始边界,传输会一路递增到"回绕边界"后跳回突发的开头。

计算方式我总结成三步:

  1. 先算突发的总字节数 = 传输次数 × 每拍字节数(由HSIZE决定)
  2. 把起始地址向下对齐到总字节数的整数倍,得到回绕边界
  3. 从起始地址开始递增,越过总字节数范围就减回去

举个例子:HADDR = 0x100C,HSIZE = 3'b010(4字节),HBURST = WRAP4。总字节数 = 4 × 4 = 16 = 0x10。回绕边界 = 0x100C & ~0xF = 0x1000。地址序列是:0x100C → 0x1000 → 0x1004 → 0x1008,四拍结束。注意第一拍不是从边界开始,是从0x100C开始,绕一圈回来。

再举个例子:HADDR = 0x1014,HSIZE = 3'b010(4字节),HBURST = WRAP8。总字节数 = 8 × 4 = 32 = 0x20。回绕边界 = 0x1014 & ~0x1F = 0x1000。序列是:0x1014 → 0x1018 → 0x101C → 0x1000 → 0x1004 → 0x1008 → 0x100C → 0x1010。八拍结束。

这里的关键是那个掩码运算:boundary = addr & ~(total_bytes - 1)。只要total_bytes是2的幂(WRAP4/8/16都是),这个式子就成立。写代码实现的时候,这个掩码可以直接用位与实现,非常省资源。

WRAP的存在意义是什么?主要是配合cache的行填充。cache行通常是16字节或32字节对齐的,CPU可能从行的中间开始访问,WRAP保证一次突发就能把整行填满,且刚好绕回行首。这个设计思路在今天的AXI里还保留着,只是名字换成了WRAP burst。

3.3 1KB边界限制与它引发的一连串设计约束

协议里有一条硬性规定:任何突发传输都不能跨越1KB(0x400)的地址边界。这条规则不是随便定的,背后是地址译码的实现方式。

AHB的地址译码器通常只译码高位地址,低10位直接透传给从机内部使用。如果一次突发跨越了1KB边界,那么突发的后半段可能落到另一个从机的地盘上,而AHB的架构里一次传输只能选中一个从机(HSEL在突发期间保持不变),所以就冲突了。为了简化译码逻辑,协议干脆规定不让跨。

这条约束给主机设计带来了实际负担。比如你要做一个DMA,要把一大块数据搬到某地址,起始地址和长度是软件配置的,你怎么保证不跨1KB?常见做法是在主机内部把长传输拆成多个突发,每个突发的起点对齐到1KB,长度不超过剩余的1KB空间。

举个具体算法:假设要写1000字节到起始地址0x13F0,用INCR突发、HSIZE=4字节。

  • 第一个突发:从0x13F0到0x13FF,还剩16字节,最多4拍
  • 边界到了0x1400,重新开始
  • 第二个突发:从0x1400开始,剩下的984字节,可以拆成多个INCR16(每拍4字节,16拍=64字节),15个完整的INCR16共960字节,到0x17C0
  • 剩下24字节,用INCR4加INCR2……等等,INCR2不存在,得用INCR或SINGLE凑

这个拆分逻辑看起来琐碎,但实际项目里必须写对,否则跨边界的突发会被从机直接拒绝或者行为未定义。我建议把这段拆分封装成一个独立的小模块,单独做覆盖率验证,别混在主机的状态机里。

还有一点:WRAP突发天然不会跨1KB边界,因为它的总跨度最大也就是16×128=2048字节……等等,WRAP16配上HSIZE=3'b111(128字节),总跨度是2048字节,超过1KB了。所以协议里对WRAP还有额外限制:WRAP突发的总字节数不能超过1KB,实际使用中HSIZE配到这么大配WRAP16是非法组合。这一点在多份协议文档里描述得不太一样,我建议在自己的从机里加个断言,遇到这种配置直接报错。

3.4 提前终止突发:HTRANS=BUSY与主机的收尾姿势

突发跑一半,主机想停下了,怎么收场?这是设计里必须处理的分支,但很多代码只写了"正常跑完"的路径。

第一种方式:用IDLE结束。主机在某一拍把HTRANS从SEQ改成IDLE,表示这个突发我不要再传了。这种情况下从机不能假设突发一定跑满长度,必须能够接受"半路终止"。所以从机的状态机设计里,判断突发结束的条件应该是HTRANS != SEQ,而不是"数够N拍"。

第二种方式:用BUSY插入空拍。BUSY的意思是"我这个周期没法传数据,但突发还没结束"。典型场景是主机在突发中间需要去处理别的紧急事情,又不能丢掉当前突发的上下文,就先插个BUSY保命。注意BUSY拍里地址不推进,从机也不能执行任何操作。

这里有个非常容易踩的坑:BUSY后必须跟SEQ。协议规定BUSY只能出现在突发的中间,它的前后必须是SEQ。如果主机用BUSY之后跟了一个IDLE,那就是非法序列。很多主机模型写得随意,仿真能跑,上板就出问题。我建议在从机里加一条断言专门盯这个。

还有一个不容易注意到的点:某些老版本的AHB实现里,BUSY可以用来"暂停"突发而不影响从机的状态机。但如果从机设计得比较激进,在BUSY拍里已经开始预取下一拍的数据,可能会读到不该读的东西。安全做法是从机在BUSY拍里什么都不做,完全静默。

4. 异常响应与突发中断:ERROR、RETRY、SPLIT三条路怎么选

正常传输跑通只是及格线,真正考验设计水平的是异常路径。AHB提供三种非OKAY响应:ERROR、RETRY、SPLIT。这三种响应在今天的AHB-Lite里已经砍掉了SPLIT,RETRY也比较少见,但理解它们的设计意图,对你写出健壮的从机非常有帮助。

4.1 两拍ERROR响应的时序要求与常见违例

ERROR响应的时序非常特殊:它必须占两拍,而且这两拍的HRESP都是ERROR,但HREADY的取值不同:

  • 第1拍:HRESP = ERROR,HREADY = 0(也就是HREADYOUT拉低)
  • 第2拍:HRESP = ERROR,HREADY = 1

为什么必须两拍?因为主机需要在第一拍看到"出错了"这个信息,然后在第二拍才结束这次传输。如果只给一拍,主机可能来不及反应。这个设计在协议里叫"two-cycle ERROR response"。

实际写从机时,最常见的违例是只给了一拍ERROR。这种错误在简单仿真里可能不报,因为主机模型宽容;但换个严格的主机模型或者上FPGA联调,就会出现主机状态机卡死。我建议从机的ERROR路径单独写一个两态小状态机,确保两拍一定给足。

第二个常见违例是在数据相位才决定报错,但地址相位已经ACK了。严格来说,从机可以在数据相位报ERROR,协议允许。但要注意:如果是写传输,主机在数据相位已经把HWDATA送上来了,这时候报错意味着"这次写没生效",从机必须保证内部的写操作确实没有被执行。很多从机实现里,写使能在数据相位一上来就拉高,等发现地址非法时数据已经写进去了——这就属于"报错了但副作用还在",非常危险。正确做法是先做合法性检查,通过了才真正执行写。

4.2 RETRY与SPLIT的区别,以及SPLIT退场后的现实选择

RETRY和SPLIT都是为了解决"从机暂时无法服务"的问题,区别在于:

  • RETRY:从机告诉主机"我现在忙,你过会儿重发一次"。主机收到RETRY后会重新发起这次传输,地址相位重来一遍。
  • SPLIT:从机告诉主机"我处理不了,先把这次传输挂起,等我处理完了再通知你"。主机收到SPLIT后必须释放总线,让别的从机用,等从机发来SPLIT完成信号再重试。

SPLIT的意图很明确:提升多主机系统下的总线利用率。一个慢速从机处理传输要几十个周期,如果一直占着总线,其他主机的传输全被卡住。SPLIT允许在等待期间把总线让出来。

但SPLIT实现起来极其复杂:需要额外的SPLIT完成信号通路(HSPLIT)、需要跟踪未完成的传输、需要处理多个挂起请求的仲裁。结果就是绝大多数实际项目里根本不用。AHB-Lite直接把它砍了,只保留ERROR和RETRY,甚至RETRY在新设计里也很少用。

现实中的替代方案是:用HREADYOUT拉长等待周期。虽然这样会挡住总线,但如果从机的处理延迟在几十拍以内,直接等反而比SPLIT更简单可靠。我个人的经验是:只要从机响应延迟不超过50拍,优先用HREADYOUT等待;超过这个量级,才考虑上更复杂的架构(比如加个FIFO缓冲)。

4.3 从机在突发中途报错的正确姿势

突发跑到一半,从机突然发现某个地址非法、或者内部FIFO满了,怎么报错?这个问题比单次传输报错麻烦得多。

协议规定:突发中途报ERROR,会中止整个突发。也就是说,从机在第N拍给出ERROR两拍响应后,主机必须停止后续传输,整个突发作废。这里的关键是"作废"——之前已经成功的N-1拍数据是有效的,但从机不能指望后面的拍还会来。

实现时要注意几点:

第一,ERROR响应的两拍里,突发上下文不能丢。从机要清楚自己处在哪个突发的第几拍,因为主机可能在ERROR后立刻发起新的传输,从机需要正确重置内部计数器。

第二,写突发的部分写入问题。如果突发写了3拍后第4拍报错,前3拍的数据已经写进去了,从机内部的数据处于"半更新"状态。这在功能上是不是可接受,取决于你的设计约定。如果不可接受,就必须引入缓冲:整个突发先写到缓冲区,全部成功后再一次性提交,任何一拍出错就整体丢弃。这个做法成本不低,但能保证数据一致性。

第三,读突发的部分读出问题。读突发中途报错,前面读出来的数据主机可能已经用掉了,后面的没了,主机得自己处理这个不一致。这属于系统层面的事,从机管不了,但设计文档里必须写清楚。

我在一个项目里遇到过这样的场景:从机内部有个FIFO,读突发的时候第5拍FIFO空了,从机就报了ERROR。结果主机的DMA把前面4拍数据当成了完整的块处理,后面出现数据错位,查了很久才发现是"部分读"导致的。后来改成从机在突发开始前先检查FIFO里够不够整个突发的数据量,不够就提前报错,问题才解决。这个教训我记到现在:要么全给,要么早拒绝,别给一半。

5. 动手写一个带突发支持的AHB从机:状态机与握手细节

理论讲够了,直接上代码。这一节我写一个最小可用的AHB从机,支持突发读写、支持等待周期插入、支持ERROR响应。代码不多,但每一行都有讲究,我会逐段解释。

5.1 从机接口信号梳理与寄存器映射思路

先定接口。这是一个简化的AHB-Lite从机,32位地址、32位数据:

module ahb_slave_demo #( parameter AW = 32, parameter DW = 32, parameter DEPTH = 256 )( input wire hclk, input wire hresetn, // 地址相位信号 input wire hsel, input wire [AW-1:0] haddr, input wire [1:0] htrans, input wire hwrite, input wire [2:0] hsize, input wire [2:0] hburst, input wire [3:0] hprot, // 数据相位信号 input wire [DW-1:0] hwdata, output reg [DW-1:0] hrdata, output reg hreadyout, output reg [1:0] hresp );

HSEL这里假设已经由外部译码器产生,从机内部不再做地址译码。实际项目里通常会在从机内部再按高位地址分几个子区域,这个看需求。

寄存器映射我按最简单的来做:haddr[AW-1:2]作为字索引,直接索引到一个寄存器数组。实际项目里通常会有控制寄存器、状态寄存器、数据窗口几类,需要更细的译码逻辑,但骨架是一样的。

核心寄存器:

reg [DW-1:0] mem [0:DEPTH-1]; // 地址相位锁存 reg [AW-1:0] addr_q; reg write_q; reg [2:0] size_q; reg [2:0] burst_q; reg [1:0] trans_q;

这几个锁存寄存器是整个从机的记忆,地址相位采到什么,数据相位就用什么。

5.2 从状态机设计:IDLE、数据相位、等待插入

从机的状态机其实很简单,因为AHB的大部分复杂性都在"相位"这个概念里,而不是在状态跳转上。我把它拆成三个状态:

状态含义跳转条件
ST_IDLE空闲,等待地址相位采到合法地址相位 → ST_DATA
ST_DATA数据相位处理中无等待 → 回ST_IDLE;有等待 → ST_WAIT
ST_WAIT插入等待周期内部就绪 → 回ST_IDLE

这里有个设计选择:突发过程中不回到IDLE。因为突发是连续的,每一拍地址相位采完立刻进入数据相位,中间没有空档。如果为了省事每拍都回IDLE,功能上没错,但会浪费一个周期,吞吐率掉一半。

所以我把状态机改成两态:ST_IDLE和ST_DATA,突发期间一直待在ST_DATA里,靠内部计数器区分"当前是第几拍"。

localparam [1:0] HTRANS_IDLE = 2'b00; localparam [1:0] HTRANS_BUSY = 2'b01; localparam [1:0] HTRANS_NONSEQ = 2'b10; localparam [1:0] HTRANS_SEQ = 2'b11;

状态机主体:

// 数据相位是否在等待 reg wait_state; // 地址相位采样条件 wire addr_phase_valid = hsel && hreadyout && (htrans == HTRANS_NONSEQ || htrans == HTRANS_SEQ); // 写操作在数据相位完成 wire write_fire = addr_phase_valid && write_q && !wait_state && hready; // 读数据在数据相位给出 wire read_fire = addr_phase_valid && !write_q && !wait_state && hready;

注意addr_phase_valid里用了hreadyout,而不是全局HREADY。在单从机系统里两者等价,但在多从机系统里,从机只能看到自己的HREADYOUT,全局HREADY是外部产生后回送的。为了代码通用,从机内部应该引用外部输入的HREADY(这里简化成HREADYOUT直连)。

还有个细节:write_fire里同时判断了addr_phase_valid和write_q。为什么不是write_q直接用地址相位的hwrite?因为写操作发生在数据相位,而数据相位对应的地址相位是上一拍采的,必须用锁存值。这是流水线设计的核心,一定要想明白。

5.3 一个可综合的从机代码骨架与逐行说明

把上面拼起来,完整的实现大概是这个结构:

always @(posedge hclk or negedge hresetn) begin if (!hresetn) begin addr_q <= {AW{1'b0}}; write_q <= 1'b0; size_q <= 3'b010; burst_q <= 3'b000; trans_q <= HTRANS_IDLE; hreadyout <= 1'b1; hresp <= 2'b00; end else begin // 默认值 hreadyout <= 1'b1; hresp <= 2'b00; // 地址相位锁存 if (addr_phase_valid) begin addr_q <= haddr; write_q <= hwrite; size_q <= hsize; burst_q <= hburst; trans_q <= htrans; end // 数据相位处理:写 if (write_fire) begin mem[addr_q[AW-1:2]] <= hwdata; end // 数据相位处理:读 if (read_fire) begin hrdata <= mem[addr_q[AW-1:2]]; end // 等待插入示例:如果地址越界,插一拍等待再报错 if (addr_phase_valid && (haddr[AW-1:8] != 0)) begin hreadyout <= 1'b0; end end end

这段代码有几个地方值得单独说。

第一,hreadyout默认给1。这是AHB从机的标准写法,只有在需要等待时才拉低。这样代码简洁,综合出来的逻辑也简单。

第二,hrdata用非阻塞赋值。读数据在数据相位的那一拍结束时更新,主机在下一个上升沿采样,正好匹配。如果用阻塞赋值,时序上会差一拍,读出来的数据错位。

第三,mem的写使能。注意write_fire的判断,它要求地址相位有效、当前是写操作、不处于等待状态。三个条件缺一不可,漏一个就会产生意外写入。

第四,那个haddr[AW-1:8] != 0的越界检测是个示意。实际项目里地址合法性检查会比这个复杂,要覆盖对齐、大小、突发类型等各种情况。

还有一个综合相关的注意点:如果DEPTH比较大,mem会综合成RAM,此时读数据有一拍延迟,hrdata的赋值方式要跟着改,可能会引入额外的等待周期。这个我在下一小节细说。

5.4 常见综合与仿真不一致的地方

仿真跑通,综合后功能不对,这是数字设计里的经典问题。AHB从机这块,我踩过的坑主要有三类。

第一类:异步复位与同步释放。hresetn如果是异步复位,综合工具会按异步处理,但如果复位释放的时机不满足恢复/移除时间,可能进入亚稳态。稳妥做法是加个复位同步器,把异步复位转成同步释放。这个不是AHB特有的问题,但总线作为系统级模块,对复位质量要求更高。

第二类:存储器的读写冲突。如果mem综合成单口RAM,同一拍既要读又要写就会冲突。AHB的读写是分时的(HWRITE在地址相位决定),所以正常情况下不会冲突,但如果从机内部有预取逻辑,就可能。我建议在存储器外包一层简单的读写仲裁,冲突时优先后写,读操作插入等待。

第三类:组合逻辑路径过长。addr_phase_valid这个信号如果组合路径太长,可能成为时序瓶颈。它依赖HSEL、HREADYOUT、HTRANS三个信号,如果HSEL来自复杂的地址译码,路径会更长。实际项目里常见做法是把HSEL提前译码好、寄存一拍,代价是多一拍延迟,但时序好收敛。

还有一个仿真与综合的差异点容易被忽略:X态传播。仿真时未初始化的寄存器是X,综合后是0或者不确定值。从机里如果有"只在某些条件才赋值"的寄存器,仿真可能因为X态而"恰好"功能正确,综合后就露馅。我建议所有寄存器在复位时都给明确初值,别指望综合工具的默认行为。

6. 验证与调试:那些仿真波形里才看得见的问题

代码写完只是开始,能不能跑对靠验证。AHB的验证难点在于相位关系和时序窗口,这两样东西在普通的功能测试里很容易漏。

6.1 断言清单:写哪些SVA能抓住80%的协议违例

断言是AHB验证的利器。我把我常用的几条整理成表,各位可以直接拿去用:

断言名检查内容触发场景
a_addr_stableHREADY为低时HADDR保持不变等待周期
a_wdata_stable写传输等待期间HWDATA不变写等待
a_busy_followBUSY后必须跟SEQ突发中断
a_error_two_cycleERROR响应必须持续两拍异常响应
a_hsel_stable突发期间HSEL保持不变跨从机突发
a_size_alignHADDR必须按HSIZE对齐非法配置
a_burst_1k突发不跨1KB边界长突发

拿a_addr_stable举例,SVA写出来是:

property p_addr_stable; @(posedge hclk) disable iff (!hresetn) (!hready) |=> ($stable(haddr) && $stable(htrans) && $stable(hwrite)); endproperty a_addr_stable: assert property (p_addr_stable) else $error("HADDR changed during wait state!");

这条断言能抓住绝大多数"等待期间信号跳变"的问题。我遇到过主机模型自己写错,等待期间HADDR跳了,导致从机读错地址的情况,就是靠这条断言发现的。

a_error_two_cycle稍微复杂一点,因为它要检查连续性:

property p_error_two_cycle; @(posedge hclk) disable iff (!hresetn) (hresp == 2'b01 && !hready) |=> (hresp == 2'b01 && hready); endproperty

注意第一拍是hresp==ERROR && !hready,第二拍是hresp==ERROR && hready。这个组合不能反,反了就说明你的从机时序拍数错了。

6.2 典型波形排查:HREADY提前拉低、HTRANS跳变

断言能抓住的是一部分,还有一些问题得靠看波形。我列几个典型的"波形长相"和对应的病因。

症状一:从机读出的数据总是慢一拍。波形上看,第2拍HREADY拉高、HRDATA更新,但主机采到的还是第1拍的值。病因通常是HRDATA的驱动时机错了,用阻塞赋值或者在数据相位开始才组合输出。改成在数据相位结束时用非阻塞赋值,问题消失。

症状二:突发跑到一半地址不递增了。波形上看,HTRANS一直是SEQ,但HADDR卡住不动。这种情况一般是主机内部的地址计数器没有在HREADY为高时更新,或者更新条件写成了hready && !wait,多加了不必要的判断。正确条件就一个:hready为高且当前HTRANS为SEQ。

症状三:写传输的数据写进去了但地址错位。波形上看HWDATA序列是对的,但读回来错开一个位置。病因基本可以锁定在从机的地址锁存上,可能是addr_phase_valid用了错误的条件,导致地址相位晚采或早采。检查一下HREADY的采样时刻对不对。

症状四:ERROR之后总线卡死。这个通常是ERROR响应少给了一拍,主机在等第二拍没等到。也可能反过来,从机给了两拍但主机的状态机只处理一拍,多出来的那拍被当成了新传输。两种情况都要看,不能只怪从机。

我个人的习惯是:每写一个从机,先把"单次读、单次写、突发读、突发写、错误响应"这五个场景的波形截下来存档,作为基准。后面改代码出问题,拿去对比,差异一眼就能看出来。

6.3 时序收敛与跨时钟域处理

最后聊两个工程性问题。

时序收敛方面,AHB最容易出问题的路径是HREADY。它从从机的HREADYOUT出发,经过地址译码多路选择器回到主机,路径可能跨好几个模块。如果主频要求高(比如200MHz以上),这条路径肯定要优化。常见做法有两个:一是在多路选择器后加一级寄存器打拍,代价是总线多一拍延迟,需要主机和从机都配合;二是把从机的HREADYOUT提前一拍算出来,用寄存输出代替组合输出。第二种做法更常见,代价是等待周期的判断要往前提一拍,逻辑稍复杂。

跨时钟域方面,AHB本身是同步总线,所有设备挂在同一个HCLK下。但实际系统里经常有异步的从机,比如外部存储器接口、低速外设,它们的时钟跟总线时钟不一样。这时候需要加一个AHB桥,把同步协议转成异步握手。桥的设计要点是:地址相位和数据相位都要做跨时钟域同步,用握手信号保证不丢不重。这块的坑很多,尤其是突发传输跨时钟域时,地址序列必须完整传递过去,不能只传首地址。我在一个项目里就是因为桥只传了首地址和长度,WRAP突发的回绕信息丢了,从机那边算出来的地址序列跟主机完全对不上,数据全乱。

如果你正在做AHB相关的项目,我的建议是:先把单次传输的波形吃透,再上突发;先把零等待从机跑通,再加等待;先把正常路径验证完,再造异常。这个顺序别跳,跳了就容易在某个环节卡很久。协议文档要看,但别一上来就通读,容易看晕,等有了具体问题再回去查对应章节,效率高得多。

版权声明: 本文来自互联网用户投稿,该文观点仅代表作者本人,不代表本站立场。本站仅提供信息存储空间服务,不拥有所有权,不承担相关法律责任。如若内容造成侵权/违法违规/事实不符,请联系邮箱:809451989@qq.com进行投诉反馈,一经查实,立即删除!
网站建设 2026/10/29 16:09:37

python实现精准搜索并提取网页核心内容

前言 标题里的「精准」二字需要先打个折扣。网页正文提取&#xff08;content extraction&#xff09;从原理上就是启发式的&#xff0c;不可能 100% 准确。原因很简单&#xff1a;HTML 只是排版语言&#xff0c;它没有字段告诉机器「这段是正文、那段是广告」。一个 div 可以是…

作者头像 李华
网站建设 2026/10/29 16:08:55

ponytail插件化架构解析:轻量灵活的工程实践指南

1. 从“ponytail”这个词说起&#xff1a;它到底指什么第一次看到“ponytail”这个词&#xff0c;绝大多数人脑子里蹦出来的画面是发型——马尾辫。没错&#xff0c;字面意思确实如此。但如果你是在技术社区、插件市场或者开发者的聊天记录里反复撞见这个词&#xff0c;那它大概…

作者头像 李华
网站建设 2026/10/29 16:08:51

智能交通系统中的深度学习流量预测实战

1. 项目背景与核心价值交通流量预测是智能交通系统&#xff08;ITS&#xff09;的核心模块&#xff0c;直接影响着城市道路规划、信号灯控制和出行路线推荐。传统基于统计模型&#xff08;如ARIMA&#xff09;的方法在应对突发流量变化时表现乏力&#xff0c;这正是深度学习技术…

作者头像 李华
网站建设 2026/10/29 16:08:48

DDR子系统板级调试:初始化、训练与误码排查全链路

1. 先把“内存条”这层壳掀掉&#xff1a;DDR子系统在板级到底由什么拼成写完第一篇之后&#xff0c;收到最多的一类问题几乎都长一个样&#xff1a;速率我算得出来&#xff0c;CL 和 tRCD 我也知道是什么&#xff0c;可板子一上电就是起不来&#xff0c;要么训练直接不过&…

作者头像 李华
网站建设 2026/10/29 16:07:53

Nginx反向代理下Druid监控静态资源404问题解决方案

1. 问题现象与背景分析那天我正在将若依框架部署到生产环境&#xff0c;Nginx作为反向代理服务器配置完成后&#xff0c;发现了一个奇怪的问题&#xff1a;Druid监控页面的CSS和JS文件全部报404错误&#xff0c;而其他静态资源却能正常加载。这直接导致Druid监控页面样式错乱&a…

作者头像 李华
网站建设 2026/10/29 16:07:39

把“无可挑剔”变成方法:功能、审美与体验的三层打磨

我第一次认真掂量“impeccable”这个词&#xff0c;是在一次产品交付前的内部评审会上。团队打磨了三个月的方案&#xff0c;被一位资深前辈看了十分钟&#xff0c;她只说了一句&#xff1a;“整体思路没问题&#xff0c;但几个细节还不够 impeccable。”没人觉得被冒犯&#x…

作者头像 李华