news 2026/11/3 20:06:49

AMBA AXI3五通道握手、突发传输与ID乱序解析

作者头像

张小明

前端开发工程师

1.2k 24
文章封面图
AMBA AXI3五通道握手、突发传输与ID乱序解析

简介:《AMBA AXI3中文协议详解》是一份面向嵌入式系统、SoC设计与验证初学者的中文协议学习材料,聚焦AMBA AXI3总线的高带宽、低延迟设计方法,帮助读者建立从协议架构到通道信号的整体认识。内容围绕AXI协议目标、关键特性与读写架构展开,具体涉及分离的地址/控制与数据相位、字节选通非对齐传输、基于突发的传输方式、独立读写数据通道、outstanding与乱序传输机制,以及VALID/READY双向握手机制和读地址、读数据、写地址、写数据、写响应五类通道的定义,并说明如何通过添加寄存器改善时序收敛。压缩包仅含1个PDF文件,约1.5MB,篇幅集中,便于随时查阅和对照规范阅读。目前已有531人学习,适合作为AXI3协议入门梳理、面试复习或查阅总线接口要点的轻量参考。

1. 反直觉结论:AMBA AXI3 的高性能,先把“等待”拆成了五个通道

AMBA AXI3 协议最容易被误解的一点,是把它当成一条更宽、更快的总线。真正让高频系统跑起来的,不是把数据线从 32 位拉到 1024 位,而是把一次传输拆成地址、写数据、写响应、读地址、读数据五个独立通道,再用 VALID/READY 做双向流控。主机不必等从机收完地址才发数据,从机也不必等数据齐了才回响应;中间插一级寄存器片,时序收敛就多了一条路。这个设计解决了传统共享总线里“地址和数据绑死、快慢设备互相拖累”的问题,也解释了为什么 AXI 波形里会出现地址先走、数据后到、响应再晚几拍的场面。搞懂这套解耦,后面看突发、ID 排序、乱序完成才不会觉得是玄学。

2. 五通道与 VALID/READY:为什么握手不能有组合环

2.1 五个通道到底解耦了什么

AXI3 把一次事务拆成五个独立通道,每个通道只在一个方向上传信息,而且通道之间不要求固定先手关系。写地址通道负责把 AWID、AWADDR、AWLEN、AWSIZE、AWBURST、AWLOCK、AWCACHE、AWPROT 和 AWVALID/AWREADY 送过去;写数据通道负责 WID、WDATA、WSTRB、WLAST 和 WVALID/WREADY;写响应通道单独用 BID、BRESP、BVALID/BREADY 回一个完成状态。读侧则是读地址通道和读数据通道,读响应 RRESP 跟着读数据走,不再单独开响应通道。

通道主要信号组方向关键约束
写地址AWID/AWADDR/AWLEN/AWSIZE/AWBURST/AWVALID/AWREADY主机到从机地址和控制信息只发一次,后续地址由从机算
写数据WID/WDATA/WSTRB/WLAST/WVALID/WREADY主机到从机每 8 位一个 WSTRB,WLAST 标最后一拍
写响应BID/BRESP/BVALID/BREADY从机到主机每个写突发只回一次,不是每拍回一次
读地址ARID/ARADDR/ARLEN/ARSIZE/ARBURST/ARVALID/ARREADY主机到从机主机只给起始地址
读数据RID/RDATA/RRESP/RLAST/RVALID/RREADY从机到主机RLAST 标最后一拍,RRESP 随数据返回

这种拆法的直接收益是“地址相位”和“数据相位”可以重叠。主机发完第一个读地址后,从机还在准备数据,主机就能把第二个地址压进读地址通道;写侧更明显,写数据甚至可以在写地址之前出现在接口上,只要地址通道里插的寄存器级比数据通道多。互联要做的不是把两者绑死,而是在必须决定目标从机时重新对齐地址和写数据,保证写数据只落到被寻址的从机。协议只硬性保留两条关系:读数据必须始终紧跟在对应地址之后,写响应必须始终紧跟在写事务中相关的最后一个写传输之后。

写响应通道单独存在,是很多人第一次看波形时的疑惑点。写数据通道是单向的,主机把数据推出去就结束了吗?没有。从机可能发现地址解码错误、写保护错误,或者内部缓冲区已经满,必须有一个独立回程告诉主机“这个写突发完成了,状态是 OKAY、EXOKAY、SLVERR 还是 DECERR”。如果让写数据通道兼做响应,方向会打架,时序也会被拖长。读侧不需要独立响应通道,因为读数据本来就是从机往主机送,RRESP 搭在数据旁边最省线。

我一般会这么理解:AXI3 不是把总线做复杂,而是把“谁等谁”这件事拆开,让每个通道自己握手。代价是波形更难读,收益是高频系统里每一段长路径都能单独插寄存器片,不必为了一个全局同步点牺牲频率。

2.2 VALID 与 READY 的依赖方向:死锁是怎么被协议提前堵住的

五个通道都用同一套双向流控:源设备拉 VALID,表示地址、数据或控制信息已经有效;目的设备拉 READY,表示能接收;只有同一拍 VALID 和 READY 都为高,传输才发生。协议给了一条非常关键的依赖规则:一个 AXI 组件的 VALID 不能依赖事务中其他组件的 READY;READY 可以等待 VALID 断言。这条规则不是风格建议,而是防死锁的硬约束。

读事务里,从机可以先等 ARVALID 拉高,再拉 ARREADY;但 RVALID 必须等 ARVALID 和 ARREADY 都采样成功之后才能拉。写事务里,主机必须先驱动 AWVALID 或 WVALID,不能把 WVALID 的拉高建立在“等到 AWREADY 再说”上;从机可以等 AWVALID 或 WVALID 再回 AWREADY/WREADY,但主机侧必须先给出至少一个 VALID。最容易踩坑的场景是:主机想等 AWREADY 拉高后再发 WVALID,从机想等 WVALID 拉高后再拉 AWREADY,双方互相等,仿真直接挂死。写响应也一样,从机必须等 WVALID 和 WREADY 都完成之后,才能拉 BVALID。

// 检查:VALID 拉高而 READY 未到时,地址 payload 必须保持稳定 property p_aw_payload_stable; @(posedge ACLK) disable iff (!ARESETn) (AWVALID && !AWREADY) |=> (AWVALID && $stable(AWADDR) && $stable(AWLEN) && $stable(AWSIZE) && $stable(AWBURST) && $stable(AWID)); endproperty assert property (p_aw_payload_stable); // 检查:WLAST 只能出现在写突发的最后一拍,不能提前或延后 property p_wlast_position; @(posedge ACLK) disable iff (!ARESETn) (WVALID && WREADY && WLAST) |-> (beat_cnt == AWLEN); endproperty

上面第一个断言盯的是“VALID 已拉高、READY 还没来”的窗口,AWADDR、AWLEN、AWSIZE、AWBURST、AWID 这些 payload 必须保持不变,否则从机在 READY 拉高那拍采到的地址可能已经不是主机以为的地址。第二个断言把 WLAST 和 AWLEN 绑在一起,beat_cnt 是从写突发开始计数的拍数,AWLEN 是“传输次数减一”,所以最后一拍的计数值应该等于 AWLEN。这类断言放在模块边界上,比事后看波形猜“为什么从机写错地址”有效得多。参数上,disable iff (!ARESETn) 让复位期间不检查,避免复位释放阶段误报;$stable 是采样沿之间的稳定性检查,适合抓 payload 被组合逻辑改掉的场景。

还有一条容易被忽略的约束:主机和从机接口的输入信号与输出信号之间不能有组合路径。也就是说,不能把对方的 READY 直接用组合逻辑拉出自己的 VALID,也不能让 READY 组合依赖 VALID 后再绕回自己的输出。协议允许 READY 等 VALID,但实现上通常会把等待做成寄存器化或至少保证没有组合环,否则综合出来的时序会非常难看,仿真也可能出现零延迟振荡。

2.3 握手时序的三种形态与默认值陷阱

VALID/READY 的时序只有三种形态:VALID 先到,READY 后到;READY 先到,VALID 后到;两者同拍到。第一种最常见,源设备先把地址或数据摆上总线,目的设备过几拍才准备好;第二种要求目的设备在数据还没效之前就表示能收,适合固定延迟的流水线;第三种最省周期,但要求双方节奏刚好合上。三种形态都不影响正确性,只影响吞吐和延迟。

默认值是个高频踩坑点。写地址通道的 AWREADY 推荐默认为高,但前提是从机必须能接收任何有效地址;如果默认为低,传输至少要多占一个周期,因为第一拍拉 AWVALID,第二拍才能等来 AWREADY。写数据通道的 WREADY 默认为高更严格,只有从机可以始终在一个单周期内接收写数据时才成立。写响应通道的 BREADY 默认为高,要求主机任何时候都能单周期接收写响应;读数据通道的 RREADY 默认为高,要求主机在任何时候开始读事务都能立即接收读数据。默认低不是错,但会把每个事务的固定开销拉长,系统吞吐会被这些“至少两拍”慢慢吃掉。

WSTRB 在 WVALID 为低时可以是任意值,协议推荐保持低或者保持前值。很多实现会偷懒让 WSTRB 在无效周期乱翻,仿真看不出问题,到了门级或者跨时钟域边界就可能被误采样。RLAST 和 WLAST 也不是“可选提示”,它们标的是突发的最后一拍,从机产生 RLAST 要跟 ARLEN 对齐,主机产生 WLAST 要跟 AWLEN 对齐。突发中间不能提前终止来减少传输次数,写侧可以取消所有 WSTRB 来禁用后续写,但必须把剩余拍走完;读侧可以丢弃后续读数据,但同样必须完成突发。访问 FIFO 这类读敏感设备时,丢弃未请求的读数据可能导致数据丢失,主机不能用一个大于请求长度的突发去“顺手多读”。

3. 突发传输:为什么地址只发一次,4KB 边界却是硬约束

3.1 突发长度、大小与类型编码

AXI3 是基于突发的协议,主机在每个突发开始时只给第一个字节的地址和控制信息,后续地址由从机按规则算。AWLEN 和 ARLEN 是 4 位,编码值是“传输次数减一”:b0000 表示 1 拍,b0001 表示 2 拍,一直到 b1111 表示 16 拍。每个突发 1 到 16 拍,没有组件可以提前终止突发来减少传输次数。AWSIZE 和 ARSIZE 是 3 位,表示每拍最大传输字节数:b000 是 1 字节,b001 是 2 字节,b010 是 4 字节,b011 是 8 字节,b100 是 16 字节,b101 是 32 字节,b110 是 64 字节,b111 是 128 字节。任何传输的大小都不能超过事务中组件的数据总线宽度,否则字节通道根本装不下。

编码AWLEN/ARLEN 传输次数AWSIZE/ARSIZE 每拍字节数AWBURST/ARBURST 类型
b000011b00 固定长度
b000122b01 增量 INCR
b001034b10 回环 WRAP
b001148b11 保留
b0100516
b0101632
b0110764
b01118128
b1000 到 b11119 到 16

三种突发类型各有明确用途。固定长度突发 FIXED 的每个传输地址都相同,适合反复访问同一个外设 FIFO 位置,装载和清空 FIFO 时地址不变,数据拍数变化。增量突发 INCR 的每个传输地址在前一拍基础上递增,增量值取决于传输大小,正常 memory 访问基本都用它。回环突发 WRAP 也递增,但到达回环边界时卷回到一个较低地址,专门服务高速缓存线填充。回环突发有两个硬限制:起始地址必须对齐到传输大小,突发长度必须是 2、4、8 或 16。固定长度突发没有这个长度限制,但地址恒定,窄传输时每拍使用相同的字节通道;增量或回环突发在窄传输时,每拍会落到不同的字节通道上。

突发不能跨越 4KB 边界,这条约束经常被当成“建议”,其实是硬边界。主机只给起始地址,从机负责算后续地址,如果突发跨过 4KB,地址增量可能落到另一个从机的地址空间里,互联的地址解码会直接翻车。协议要求从机在内部限制地址增量的大小,主机在发起突发前就要把跨边界的访问拆成多个突发。4KB 不是随便选的数,它和常见的页大小、地址解码粒度对齐,能让互联在边界上做简单比较,而不必为每个拍做全地址译码。

3.2 地址递增公式与 WRAP 回环的卷回点

协议给了一组公式,把突发地址的计算从“看波形猜”变成“可以复现的算术”。Start_Address 是主机发出的起始地址;Number_Bytes 等于 2 的 SIZE 次方;Burst_Length 等于 LEN 加一;Aligned_Address 等于 Start_Address 除以 Number_Bytes 取整后再乘 Number_Bytes。第一拍地址 Address_1 就是 Start_Address,第一拍之后任意一拍 Address_N 等于 Aligned_Address 加上 (N-1) 乘以 Number_Bytes。非对齐起始地址只影响第一拍的起点,后续拍会回到对齐地址上加增量的节奏。

回环突发多一个 Wrap_Boundary 变量:用 Start_Address 除以 Number_Bytes 乘以 Burst_Length 的乘积,取整后再乘同一个乘积。如果某一拍算出来的 Address_N 正好等于 Wrap_Boundary 加上 Number_Bytes 乘以 Burst_Length,就把 Address_N 改成 Wrap_Boundary,地址卷回低端。这个卷回点不是“随便回一个低地址”,而是回环窗口的底部,窗口大小等于每拍字节数乘以拍数。

def burst_addresses(start, size, length, burst, bus_bytes): nbytes = 1 << size # 每拍最大字节数 aligned = (start // nbytes) * nbytes wrap_size = nbytes * length # 回环窗口大小 wrap_base = (start // wrap_size) * wrap_size addrs = [start] # 第一拍用原始起始地址 for n in range(2, length + 1): a = aligned + (n - 1) * nbytes if burst == "WRAP" and a == wrap_base + wrap_size: a = wrap_base # 到达回环边界后卷回 addrs.append(a) return addrs, nbytes, aligned, wrap_base # 示例:4 字节传输,4 拍回环,起始 0x1004,总线 16 字节 addrs, nbytes, aligned, wrap_base = burst_addresses(0x1004, 2, 4, "WRAP", 16) print([hex(a) for a in addrs], nbytes, hex(aligned), hex(wrap_base)) # 输出地址为 0x1004, 0x1008, 0x100c, 0x1000

这段代码里,size 是 AWSIZE/ARSIZE 的整数值,2 表示每拍 4 字节;length 是 LEN 加一之后的拍数;bus_bytes 是数据总线字节数,用来提醒调用方检查传输大小不能超过总线宽度。aligned 是第一拍之后地址递增的基准,wrap_base 是回环窗口底部。示例中起始地址 0x1004 对齐到 4 字节,回环窗口是 0x1000 到 0x100f,第四拍本来会到 0x1010,正好等于 wrap_base 加 wrap_size,于是卷回 0x1000。这个计算在从机地址生成器里很常见,写错一次就会让缓存线填充落到错误行。

3.3 窄传输与非对齐:字节通道和 WSTRB 怎么算

窄传输指的是每拍传输的字节数小于数据总线宽度。比如 32 位数据总线做 1 字节传输,每拍只用一个字节通道。增量或回环突发里,窄传输的每拍会落到不同字节通道上,地址递增和字节通道偏移要一起算;固定长度突发地址不变,每拍使用相同的字节通道。这个区别在访问 FIFO 时特别明显:FIFO 地址固定,数据宽度可能只有 8 位,但总线是 32 位,固定突发让每拍都打在同一组字节通道上,从机不用改地址。

非对齐传输靠字节选通实现。写数据通道每 8 位有一个 WSTRB 位,WSTRB[n] 对应 WDATA[(8×n)+7 : (8×n)]。第一拍地址非对齐时,Lower_Byte_Lane 等于 Address_N 减去 Address_N 除以 Data_Bus_Bytes 取整后乘 Data_Bus_Bytes,Upper_Byte_Lane 等于 Lower_Byte_Lane 加 Number_Bytes 减一。数据在总线上落在 DATA[(8×Upper_Byte_Lane)+7 : (8×Lower_Byte_Lane)] 这段字节通道里,WSTRB 只把真正有效的字节拉高。非对齐只改变第一拍的起点,后续拍按对齐地址推进,所以第一拍的 WSTRB 往往是不连续的,后面几拍才变成连续掩码。

注意:非对齐写最容易犯的错,是把整拍 WSTRB 全拉高。首拍多写的字节会落到相邻地址,轻则覆盖相邻变量,重则踩到外设控制寄存器。首拍一定要按 Lower_Byte_Lane 和 Upper_Byte_Lane 算掩码,后续拍再恢复对齐掩码。

读侧没有 WSTRB,主机拿到的是从机返回的整段数据,主机自己根据起始地址和 RRESP 判断哪些字节有效。非对齐读的第一拍,从机会返回包含有效字节的整个总线宽度,主机不能假设 RDATA 的低字节就是起始地址对应的字节。窄传输读也一样,字节通道位置由地址决定,主机解包时要把字节通道偏移算进去。这个细节在验证里经常被“数据看起来对”掩盖,直到跨地址访问才暴露。

4. ID、outstanding 与乱序:为什么“不同 ID 可乱序,相同 ID 必须有序”

4.1 outstanding 与 out-of-order 不是一回事

outstanding 和 out-of-order 经常被混着说,但在 AXI3 里是两个不同维度的能力。outstanding 说的是地址和数据传输没有严格先后要求,处理两个不同 transaction 时不必等前一个完全处理完再处理下一个。主机可以把多个读地址连续压进读地址通道,从机可以慢慢回数据;写侧主机也可以连续发多个写地址和写数据,从机按自己的节奏收。outstanding 和 ID 无关,哪怕所有事务都用同一个 ID,只要从机允许,也可以有多个未完成请求。

out-of-order 说的是完成顺序。AXI3 给每个事务一个 ID tag,协议要求相同 ID tag 的事务按顺序完成,不同 ID tag 的事务可以乱序完成。互联可以让后发的、被快速从机接收的事务先于先前发给慢从机的事务完成;复杂从机也可以乱序返回读数据,比如先访问的数据还在内部缓存里等,后访问的数据已经在缓存中命中,从机可以先回后一个。乱序提高的是系统吞吐,代价是主机和互联要维护排序信息。

能力关心什么是否依赖 ID典型收益
outstanding未完成事务可以同时存在不依赖隐藏访存延迟,提高并发
out-of-order完成顺序可以打乱依赖 ID快从机不必等慢从机,缓存命中可以先返回
相同 ID 顺序同一 ID 必须按发起顺序完成是给主机一个可预测的完成顺序

如果主机要求事务按发送顺序完成,就把它们标成相同 ID;如果主机不要求顺序,就用不同 ID 发出去,让它们按任意顺序完成。简单主机可以给每个事务都用相同 ID,简单从机可以按顺序响应每个事务,完全不用考虑 ID。协议没有强迫所有设备都做乱序,复杂度是可选的。

4.2 相同 ID 的顺序约束如何落到实现

相同 ID 必须有序,这条规则落到实现上就是每个 ID 一条未完成事务队列。主机或互联在发起事务时,把事务按 ID 压进对应队列;响应回来时,用 BID 或 RID 找到队列头,只有队列头对应的事务可以完成,完成之后才能轮到下一个。不同 ID 的队列可以并行推进,所以快从机的响应可以越过慢从机,但同一个队列里的顺序不能乱。

写响应通道的 BID 必须等于对应写事务的 AWID,WID 必须等于 AWID;读数据通道的 RID 必须等于对应读事务的 ARID。BID 或 RID 对不上,scoreboard 就会把响应配到错误的事务上,数据看起来收到了,实际全错位。写响应每个写突发只回一次,不是每拍回一次;读数据的 RLAST 标记最后一拍,同一 ID 的多个读事务,前一个事务的 RLAST 必须在前一个事务的数据流里出现,后一个事务的数据不能插到前面。

from collections import defaultdict, deque pending = defaultdict(deque) def issue(txn): # 同一 ID 的未完成事务按发起顺序排队 pending[txn["id"]].append(txn) def complete(resp): q = pending[resp["id"]] assert q, "响应没有对应的未完成请求" head = q[0] assert head["addr"] == resp["addr"], "同 ID 响应越过了队头" if resp["last"]: q.popleft() # 只有最后一拍才释放队头

这段伪代码把“同 ID 有序”落成了一个 per-ID FIFO。issue 按 ID 入队,complete 只允许队头事务完成,last 为真才出队。addr 比较是简化检查,真实实现还会比长度、burst 类型和响应状态。不同 ID 各自有队列,互不阻塞,所以 ID0 的慢事务不会挡住 ID1 的快事务。参数上,id 是 AWID/ARID 的位宽扩展值,last 对应 WLAST/RLAST 或写响应的单次完成标志。放到验证环境里,这个 scoreboard 能抓住大部分“同 ID 乱序”的翻车。

4.3 互联附加 ID 与多主机虚拟化

多主机系统里,每个主机都有自己的 ID 空间。主机 A 用 ID0 发读,主机 B 也用 ID0 发读,如果互联原样把两个 ID0 送到从机,从机分不清哪个响应该回给谁。协议要求互联负责把额外信息附加到 ID tag 上,保证来自所有主机的 ID tag 在互联内部唯一。常见的实现思路是把主机编号放到 ID 高位,响应回来时再按高位路由回对应主机,低位的原始 ID 还原给主机。

ID tag 类似于一个主机号,但被扩展了。每个主机可以通过提供一个 ID tag 来表示虚拟主机号,在同一个物理端口上实现多个虚拟主机。比如一个主机内部有多个独立的数据流,每个流用不同 ID,互联把这些 ID 当成不同的虚拟主机来排序,从机看到的是一组唯一 ID,主机看到的仍是自己熟悉的 ID。这样做的好处是主机不需要知道系统里有多少其他主机,互联承担了唯一性扩展。

简单设备可以完全不碰这套复杂度。简单主机用相同 ID 发每个事务,简单从机按顺序响应每个事务,互联也不需要做 ID 扩展。复杂设备才需要 outstanding、乱序和虚拟主机。设计取舍在这里很清楚:ID 位宽越宽,互联和从机的排序表越大,时序和面积越贵;ID 位宽越窄,多主机系统的区分能力越弱,乱序带来的收益也越有限。我一般会先看系统里有多少个真正需要乱序的主机,再决定 ID 扩展位宽,而不是一上来就把 ID 拉到很宽。

5. 常见问题与排查:握手死锁、WLAST 丢失、4KB 越界和 ID 顺序翻车

5.1 握手类问题:波形停在 VALID 高、READY 低

现象:仿真跑着跑着不动了,AWVALID 和 WVALID 都是低,AWREADY 和 WREADY 也是低,双方都没有动作。原因:主机想等 AWREADY 拉高后再发 WVALID,从机想等 WVALID 拉高后再拉 AWREADY,双方互相等待,形成死锁。这违反 VALID 不能依赖 READY 的依赖规则。解决:主机先驱动 AWVALID 或 WVALID,不能把 WVALID 的拉高建立在 AWREADY 上;从机可以等 VALID 再回 READY,但不能要求主机先等 READY。排查时先看写地址和写数据两个 VALID 谁先动,如果两个都不动,基本就是互相等。

现象:AWVALID 拉高后,AWADDR 在 AWREADY 到来之前变了,从机采样到的地址和主机以为的不一致。原因:VALID 拉高后 payload 必须保持稳定,直到 READY 采样成功;组合逻辑把地址改掉,或者主机在等待期间重新计算了地址。解决:在 VALID 到 READY 之间把 payload 锁进寄存器,或在模块边界加断言检查 $stable。波形上重点看 AWVALID 为高、AWREADY 为低的窗口,AWADDR、AWLEN、AWSIZE、AWBURST、AWID 都不能变。

5.2 突发类问题:WLAST 与 AWLEN 对不上、跨 4KB

现象:写响应提前返回,或者从机一直等不到写响应;波形上 WLAST 在第 3 拍就拉高,但 AWLEN 配置的是 7。原因:AWLEN 是传输次数减一,WLAST 必须在第 LEN+1 拍拉高;主机用 WSTRB 全零取消后续写,但误以为事务提前结束了。解决:写侧维护一个按 AWLEN 装载的计数器,WLAST 只在最后一拍拉高;取消写只能取消 WSTRB,不能减少拍数。读侧同理,RLAST 由从机按 ARLEN 产生,主机不能提前认为读完成。

现象:突发访问跨过 4KB 边界,互联把部分拍路由到了另一个从机,或者从机返回 DECERR。原因:协议禁止突发跨 4KB,主机只给起始地址,从机按增量算后续地址,跨边界后地址落到了别的从机地址空间。解决:主机在发起突发前按 4KB 边界拆分,互联在地址解码处做边界检查。排查时把起始地址、AWSIZE、AWLEN 代入地址公式,算最后一拍地址,看是否越过 4KB 对齐边界。

现象:非对齐写之后,相邻变量被改坏,或者外设控制寄存器被踩。原因:首拍 WSTRB 全拉高,多写了 Lower_Byte_Lane 之前的字节;或者窄传输的字节通道偏移算错。解决:首拍按 Lower_Byte_Lane 和 Upper_Byte_Lane 算 WSTRB,只把有效字节拉高;后续拍恢复对齐掩码。波形上把 WSTRB 和 WDATA 按字节展开,逐字节对地址,不要只看整拍数据。

5.3 排序与响应类问题:BID/RID 不匹配、同 ID 乱序

现象:读数据 RID 看起来都对,但主机拿到的数据顺序错了,同一 ID 的第二个事务先返回,第一个事务的 RLAST 后到。原因:从机或互联把“不同 ID 可乱序”误用到了相同 ID 上,per-ID 队列没有拦住队头。解决:同一 ID 的未完成事务按发起顺序排队,只有队头可以完成;不同 ID 才能并行乱序。验证环境里加 per-ID scoreboard,响应回来先比对队头地址和长度,再决定是否出队。

现象:写响应 BID 和 AWID 对不上,scoreboard 报“响应没有对应请求”,但波形上写数据已经收完了。原因:互联在扩展 ID 后没有在响应路径正确还原,或者从机把 BID 接成了常量。解决:检查 BID 是否等于对应写事务的 AWID,WID 是否等于 AWID,RID 是否等于 ARID;互联扩展 ID 时,请求路径加高位,响应路径按高位路由并还原低位。简单设备可以不用乱序,但 ID 匹配不能省。

6. 设计取舍:寄存器片插入、时序收敛与验证策略

6.1 寄存器片不是“加一拍”这么简单

AXI3 的通道独立方向单一,理论上可以在任何通道中间插寄存器片,把长路径切开,用延迟换频率。协议本身不要求通道之间有固定关系,所以地址通道插两级、数据通道插一级,写数据甚至可能跑到写地址前面。互联要在必须决定目标从机时重新对齐地址和写数据,保证写数据只落到被寻址的从机。这个灵活性是 AXI 高频设计的核心,但寄存器片不是简单打一拍:VALID/READY 反压要处理,payload 要跟着 valid 走,WLAST/RLAST 不能丢,否则吞吐会掉一半或者事务边界错乱。

常见的实现思路是用 skid buffer 或带 forward path 的寄存器片,在 ready 反压时还能接一拍,避免每两拍才过一拍数据。插寄存器片之前先看通道的时序余量,地址通道通常组合逻辑深、 fanout 大,优先切;数据通道宽,寄存器面积贵,切之前算清楚收益。插完之后必须重新跑握手断言,重点看 valid 是否稳定、ready 是否组合依赖 valid、last 是否跟长度对齐。

6.2 验证先盯住握手与排序

检查项抓什么问题建议手段
VALID 稳定直到 READYpayload 被组合逻辑改掉SVA $stable 断言
VALID 不依赖 READY双方互等死锁依赖方向检查、超时监控
WLAST/RLAST 与 LEN 对齐突发提前或延后结束计数器断言、scoreboard
突发不跨 4KB地址落到错误从机地址公式检查、边界断言
同 ID 按序完成同 ID 乱序导致数据错配per-ID FIFO scoreboard
BID/RID/WID 匹配响应配错事务响应比对、ID 路由检查

验证顺序我一般先抓握手,再看突发,最后看排序。握手错的时候,后面所有数据比对都没有意义,因为事务根本没完成;突发边界错的时候,数据可能看起来对,但地址已经偏了;排序错的时候,数据本身对,配到的事务错。三层的断言分开写,失败时能快速定位是哪一层的问题。

从那以后我每次接 AXI 波形,都先把五通道的 VALID/READY 和 WLAST/RLAST 拉出来对一遍,再看 ID 队列和 4KB 边界;这套习惯比盯着数据总线猜问题靠谱。这份中文详解把信号表、握手依赖、突发地址公式和常见坑放在一处,排查时翻对应章节比重读整份规范快得多。希望帮到你。

本文还有配套的精品资源,点击获取

版权声明: 本文来自互联网用户投稿,该文观点仅代表作者本人,不代表本站立场。本站仅提供信息存储空间服务,不拥有所有权,不承担相关法律责任。如若内容造成侵权/违法违规/事实不符,请联系邮箱:809451989@qq.com进行投诉反馈,一经查实,立即删除!
网站建设 2026/11/3 20:06:48

DWG数据交换方案选型:从预览抽取到转换回写全链路

上个月有个做工程管理系统的朋友找我&#xff0c;说他们接了个需求&#xff1a;把甲方发来的一批 DWG 图纸在网页上打开&#xff0c;还要能点选图元看属性&#xff0c;最后把数据落到自己的业务库里。这其实是特别典型的 DWG 数据交换场景&#xff0c;只不过大部分团队在动手之…

作者头像 李华
网站建设 2026/11/3 20:05:28

Jutoh for Mac安装与离线授权实录:macOS电子书制作全链路验证

1. 项目概述&#xff1a;这不是“破解教程”&#xff0c;而是一次真实可用的Jutoh for Mac安装验证实录Jutoh for Mac激活安装过程分享——这个标题背后&#xff0c;藏着大量Mac用户在电子书制作场景中的真实痛点。我接触过不少文字工作者、独立出版人、网文作者和高校教师&…

作者头像 李华
网站建设 2026/11/3 20:05:27

CUDA版本迷雾:驱动、Toolkit、运行时与PyTorch四层真相

1. 为什么你看到的CUDA版本&#xff0c;可能根本不是PyTorch真正用的那个&#xff1f;“nvidia-smi显示CUDA 12.2&#xff0c;pip list里torch也是cu121&#xff0c;但一跑模型就报错‘CUDA error: no kernel image is available for execution on the device’——这到底是谁在…

作者头像 李华
网站建设 2026/11/3 20:04:49

SNMP V3配置实战:认证加密与权限控制详解

1. 为什么SNMP V3值得单独拿出来讲 干网络运维这行十几年&#xff0c;SNMP这个协议算是绕不开的老朋友了。早些年大家用V1、V2C版本&#xff0c;配置简单&#xff0c;一条命令下去就能采数据&#xff0c;图的就是省事。但这些年我经手的项目里&#xff0c;越来越多的甲方在验收…

作者头像 李华
网站建设 2026/11/3 20:03:21

单端信号转差分ADC的硬件设计三原则与避坑指南

简介&#xff1a;本资源是一份面向嵌入式硬件工程师与高精度数据采集系统设计者的TI官方技术应用报告&#xff0c;聚焦单端信号接入全差分输入ADC时的信号调理难题。针对单电源供电、双极性输入场景下如何保持满量程范围并提升抗噪性能&#xff0c;文档系统阐述了基于运放电阻网…

作者头像 李华
网站建设 2026/11/3 20:01:56

FPGA八路音频同步采集:VHDL状态机与AD7892时序控制

简介&#xff1a;面向电子工程、嵌入式与FPGA初学者及课程设计人员&#xff0c;这份文档围绕基于FPGA的多通道采样系统展开&#xff0c;重点讲解用VHDL有限状态机控制AD7892、音频信号采样及通道选择与串并输出模块的集成思路&#xff0c;可帮助读者理解高速采样控制器的整体架…

作者头像 李华