news 2026/11/4 10:46:21

MicroBlaze总线选型指南:FSL、LMB与AXI的实时性与确定性对比

作者头像

张小明

前端开发工程师

1.2k 24
文章封面图
MicroBlaze总线选型指南:FSL、LMB与AXI的实时性与确定性对比

1. 项目概述:为什么一个嵌入式软核的总线性能测试值得花两周时间调参数?

MicroBlaze,这个Xilinx(现属AMD)在FPGA上跑了十几年的精简指令集软核处理器,至今仍是很多工业控制、仪器仪表、通信前端模块里的“隐形心脏”。它不追求跑分,但求稳定、可控、可裁剪——而决定它能不能稳住的关键,往往不是主频,而是它和外部世界握手的方式:总线。标题里提到的FSL(Fast Simple Link)和LMB(Local Memory Bus),加上括号里特意强调的AXI交叉验证,不是三个并列名词,而是一条清晰的演进路径:从专用通道到片上互联标准的迁移实证。

我第一次在某高校实验室的电机控制板卡上看到FSL接口时,它正被用来传一组256点的ADC采样数据,每毫秒一次,用的是最原始的“握手+寄存器映射”方式。当时觉得够用,直到我们把算法从PID升级为带前馈补偿的模型预测控制(MPC),数据吞吐量翻了三倍,FSL链路开始出现周期性丢包——不是崩溃,是微妙的延迟抖动,导致控制环路相位偏移,电机转速纹波肉眼可见。问题不在代码,而在底层数据搬运的确定性。这促使我们系统性地回溯MicroBlaze的三种主流总线架构:FSL(点对点、无协议开销)、LMB(同步、单周期访问、仅限BRAM)、AXI(全功能、流水线、支持突发传输)。标题中“从FSL到LMB”的表述,表面是接口切换,实质是实时性保障策略的根本转向:前者靠“快”,后者靠“稳”,而AXI则是“可扩展的稳”。

这个项目不是为了证明谁更快,而是要回答三个硬问题:第一,在同等资源约束下(比如只用一块Artix-7 100T的BRAM块),FSL的峰值带宽能否持续维持?第二,LMB宣称的“单周期访问”在真实多主设备竞争场景下是否打折?第三,当系统复杂度上升(比如加入DMA引擎、视频采集IP核),AXI总线的仲裁机制如何影响MicroBlaze的响应延迟?括号里的“AXI交叉验证数据”正是为第三问准备的锚点——我们没把它当备选方案,而是作为衡量前两者局限性的标尺。适合谁参考?如果你正在用MicroBlaze做实时闭环控制、高速数据采集或需要确定性延迟的嵌入式应用,且已经卡在“功能能跑通,但指标达不到”这个阶段,这篇就是为你写的。它不讲怎么新建Vivado工程,只聚焦于你调完IP核后,真正决定系统成败的那几行约束、那几个时序报告、那组被忽略的交叉验证波形。

2. 总线架构设计逻辑:为什么FSL和LMB不是“过时技术”,而是特定场景下的最优解?

2.1 FSL:极简主义的代价与适用边界

FSL(Fast Simple Link)的设计哲学非常直白:用最少的信号线、最短的逻辑路径,实现两个IP核之间的点对点数据搬运。它只有四根核心信号:FSL_Clk(独立时钟域)、FSL_Rst、FSL_Data(32位宽)、FSL_Control(1位,标识数据有效)。没有地址、没有读写命令、没有应答机制——发送方把数据往FSL_Data上一放,拉高FSL_Control,接收方在下一个时钟沿采样即可。这种“信任即交付”的模式,带来了极致的低延迟:实测从写入到接收端锁存,仅需1个FSL_Clk周期(在100MHz下即10ns),比AXI-Lite的最小读写周期(通常需4-5周期)快了一半以上。

但它的代价同样尖锐:完全不可扩展。FSL天生是1对1连接,你想让MicroBlaze同时和ADC IP、DAC IP、UART IP通信?就得例化三套独立的FSL通道,每套占用一组FSL引脚资源。更致命的是无流控能力。当接收方处理不过来(比如ADC数据流突然爆发),FSL不会像AXI那样发READY=0暂停发送,而是继续覆盖FSL_Data寄存器——旧数据被新数据无情冲掉。我们在测试中故意用FSL传一个1024字节的校验包,当接收端插入10us软件延时后,丢包率直接飙升至37%。这不是Bug,是设计使然。所以FSL的适用边界极其清晰:超低延迟、小数据量、发送方绝对可控的场景。比如:传感器状态标志位(1bit)、紧急停机信号(1word)、单次触发脉冲(1word)。一旦涉及连续数据流或不确定长度的数据包,FSL就该让位了。

2.2 LMB:BRAM专属通道的确定性之源

LMB(Local Memory Bus)则走向另一个极端:它不追求通用性,只为MicroBlaze访问片上Block RAM(BRAM)服务。其信号精简到极致:LMB_ABus(地址线,宽度由BRAM深度决定)、LMB_WData(写数据)、LMB_RData(读数据)、LMB_BE(字节使能)、LMB_Ready(读就绪)、LMB_Wr(写使能)、LMB_Rd(读使能)。关键在于,LMB与MicroBlaze内核深度耦合——当MicroBlaze执行一条lw(load word)指令访问BRAM地址时,硬件会自动将地址送入LMB_ABus,并在下一个周期将LMB_RData送入CPU寄存器。整个过程无需软件干预,也无需额外的总线仲裁逻辑。

这带来了LMB最核心的优势:确定性单周期访问。只要BRAM没有被其他主设备(如DMA)占用,MicroBlaze对BRAM的每次读写,都严格保证在1个CPU时钟周期内完成。我们在Artix-7 100T上配置了64KB BRAM(占用32个BRAM块),将LMB时钟与MicroBlaze主频同频(100MHz),实测连续读取1MB数据,平均延迟稳定在10ns,标准差小于0.5ns。对比AXI总线在同等负载下15-25ns的波动范围,LMB的稳定性优势碾压。但它的枷锁也很明显:只能连BRAM,且必须是MicroBlaze直连的BRAM。你想用LMB访问DDR内存?不行。想通过LMB连一个自定义的FIFO IP?也不行。它的存在意义,就是为MicroBlaze打造一个“私有高速缓存区”,存放中断向量表、关键控制参数、实时计算中间变量等对延迟极度敏感的数据。在电机控制案例中,我们将PID的积分项累加值、当前PWM占空比预设值全部放在LMB挂载的BRAM里,确保每个控制周期内,这些核心变量的读写零等待。

2.3 AXI:从“够用”到“可演进”的分水岭

AXI(Advanced eXtensible Interface)是ARM提出的片上互连标准,Xilinx将其深度集成到Vivado IP Integrator中。它不像FSL和LMB那样“专精”,而是追求“全能”:支持读/写地址通道分离、数据通道独立、支持突发传输(Burst)、支持乱序完成、内置完善的流控(READY/VALID握手)和仲裁机制。一个典型的AXI4-Full接口,信号线超过50根,复杂度远超前两者。但正是这种复杂性,赋予了它无可替代的扩展性。

AXI的价值,体现在系统规模扩大后的“非线性衰减”上。当我们把系统从“MicroBlaze + ADC”升级为“MicroBlaze + ADC + DMA + Video Encoder + Ethernet MAC”时,FSL需要新增3套独立通道,布线资源紧张;LMB则完全失效,因为它无法接入除BRAM外的任何设备。而AXI只需在总线矩阵(AXI Interconnect)中增加对应从设备(Slave)端口,所有主设备(Master)通过统一的地址空间访问。更重要的是,AXI的仲裁器能根据优先级(可配置)和公平性策略,动态分配总线带宽。我们在交叉验证中,让MicroBlaze以最高优先级运行控制算法,同时让DMA以中等优先级搬运视频帧,实测MicroBlaze的平均响应延迟仅比纯空载状态增加8%,而FSL在此场景下已因资源耗尽无法工作。AXI不是为单点性能优化,而是为系统级确定性设计。标题中强调“AXI交叉验证”,正是要揭示:当你的项目从Demo走向量产,从单功能走向多任务,AXI不是“更高级的选择”,而是“唯一可持续的选择”。

3. 实测环境搭建与核心环节实现:如何让Vivado告诉你真实的总线瓶颈?

3.1 硬件平台与IP核配置:避开Vivado的“默认陷阱”

测试平台基于Xilinx Artix-7 100T FPGA(XC7A100T-2CSG324C),这是工业领域最常用的中端型号,资源足够复现典型场景又不至于掩盖瓶颈。关键不是芯片型号,而是IP核的配置细节——Vivado的默认设置往往隐藏着巨大陷阱。

首先,MicroBlaze本身必须启用Use LMB和Use FSL选项,但要注意:FSL数量默认为0,必须手动设为2(一个用于测试数据注入,一个用于结果回传);LMB宽度必须与目标BRAM深度匹配,我们使用64KB BRAM,故设LMB Address Width为16(2^16=64K)。更大的坑在AXI部分:Vivado生成MicroBlaze时,默认勾选Enable Interrupts和Enable Debug,这会悄悄占用额外的AXI Lite通道。为保证测试纯净,我们禁用所有调试接口,并将AXI总线类型明确指定为AXI4(非AXI4-Lite),因为Lite版不支持突发传输,无法体现AXI的真实带宽潜力。

其次,BRAM的配置至关重要。我们未使用Vivado自动生成的BRAM IP,而是手动例化原语RAMB18E1,并强制约束其时钟域与MicroBlaze主频一致(100MHz)。原因在于:自动生成的BRAM IP常默认启用READ_LATENCY=1,这会在读取路径上插入一级寄存器,将本应1周期的LMB访问硬生生拖成2周期。通过原语例化并设置READ_LATENCY=0,我们才真正捕获到LMB的理论极限。这一细节,文档里很少提,但实测中,它让LMB的延迟数据偏差了整整10ns。

最后,测试激励的生成方式决定了数据的真实性。我们没有用C语言循环写寄存器,而是编写了专用的Verilog测试模块,直接驱动FSL/LMB/AXI的物理信号。例如,对FSL测试,模块在FSL_Clk上升沿同时置高FSL_Control并更新FSL_Data,用ILA(Integrated Logic Analyzer)抓取FSL_Control下降沿到接收端锁存寄存器Q变化的时间差。这种方式绕过了软件开销,测得的是纯粹的硬件路径延迟。

3.2 关键参数测量方法:不只是看“带宽”,更要盯“抖动”和“确定性”

总线性能不能只看峰值带宽(GB/s),对于实时系统,延迟抖动(Jitter)和最坏情况延迟(Worst-case Latency)才是生死线。我们的测量分为三个维度:

  1. 基础延迟(Base Latency):单次操作的固有延迟。FSL:FSL_Control有效到接收端Q变化;LMB:LMB_Rd有效到LMB_RData稳定;AXI:ARVALID拉高到RVALID拉高(读事务)。使用Vivado的Report Timing工具,对关键路径进行静态时序分析(STA),而非依赖仿真波形——STA能覆盖所有PVT(工艺、电压、温度)角点。

  2. 突发传输效率(Burst Efficiency):连续传输N个数据的平均延迟。我们固定N=16(AXI突发长度),测量从第一个ARVALID到最后一个RVALID的时间跨度,再除以N。FSL不支持突发,此项为0;LMB因无地址概念,只能单字传输,效率恒为100%但带宽受限;AXI在此项上优势巨大,实测16字突发下,平均延迟降至单次的1.2倍,而FSL连续16次操作需16倍时间。

  3. 竞争压力下的抖动(Jitter under Contention):这才是交叉验证的核心。我们构建了“压力发生器”:一个独立的AXI Master IP(模拟DMA),以固定速率(如50MB/s)向同一AXI Interconnect发起读请求。然后,用MicroBlaze作为另一个Master,周期性(每1ms)发起一次单字读请求,用ILA记录每次请求的RVALID到达时间戳。计算1000次请求的延迟标准差,即为抖动值。结果触目惊心:无压力时AXI抖动为±1.5ns;加入DMA压力后,抖动扩大至±8.3ns;而LMB在同一压力下,因完全隔离于AXI总线,抖动仍稳定在±0.3ns。这组数据,直接回答了“为什么LMB在关键控制环路中不可替代”。

3.3 AXI交叉验证数据详解:一张表格看懂总线选择的决策树

交叉验证不是简单对比数字,而是构建多维场景。我们设计了4个典型负载场景,每个场景下测量FSL、LMB、AXI三项指标(基础延迟、16字突发效率、压力下抖动),数据汇总如下:

负载场景描述FSL 基础延迟FSL 抖动 (压力下)LMB 基础延迟LMB 抖动 (压力下)AXI 基础延迟AXI 抖动 (压力下)AXI 16字突发效率
场景1:空载仅MicroBlaze运行,无其他主设备10 ns±0.2 ns10 ns±0.3 ns22 ns±1.5 ns92%
场景2:轻负载MicroBlaze + UART(低速打印)10 ns±0.3 ns10 ns±0.3 ns24 ns±2.1 ns90%
场景3:中负载MicroBlaze + UART + ADC(1MSps采样)10 ns±0.5 ns10 ns±0.3 ns28 ns±4.7 ns85%
场景4:重负载MicroBlaze + UART + ADC + DMA(视频搬运)失效N/A10 ns±0.3 ns35 ns±8.3 ns78%

提示:FSL在场景4“失效”并非指电路损坏,而是指其点对点特性导致无法接入DMA等AXI设备,系统架构层面已不兼容。此时若强行用FSL传ADC数据,DMA会因总线独占而饿死,反之亦然。

这张表揭示了清晰的决策逻辑:如果系统永远只有MicroBlaze和1-2个低速外设(场景1-2),FSL的极简和低延迟是优势;如果系统有确定性要求极高的核心变量存储(如控制参数),LMB是不可替代的“安全岛”;而一旦系统引入DMA、视频、网络等高带宽、多任务模块(场景3-4),AXI是唯一能承载复杂性的骨架。标题中的“从FSL到LMB”,本质是工程师认知升级的过程:从关注单点速度,到理解系统确定性,再到拥抱可扩展架构。

4. 实操心得与避坑指南:那些Vivado不告诉你的“灰色地带”

4.1 FSL的“隐性带宽墙”:时钟域交叉才是真瓶颈

很多开发者以为FSL带宽只取决于FSL_Clk频率,实测却发现100MHz FSL实际吞吐远低于理论值(400MB/s)。问题出在时钟域交叉(CDC)。FSL虽标称支持异步时钟,但Vivado生成的FSL FIFO(用于跨时钟域缓冲)默认采用两级触发器同步,这会引入至少2个慢时钟周期的延迟。当FSL_Clk为100MHz,而MicroBlaze主频为50MHz时,发送方每10ns发一个数,接收方却要等40ns才能稳定采样——有效带宽瞬间腰斩。解决方案是:在Vivado IP Catalog中,找到FSL FIFO IP,将Synchronization Stages从默认的2改为1,并手动添加ASYNC_REG = TRUE属性到同步触发器。实测此修改后,50MHz接收端的FSL有效带宽提升65%。但这需要你深入理解CDC原理,Vivado GUI里根本找不到这个开关。

4.2 LMB的“地址对齐”玄机:错一位,延迟翻倍

LMB对地址对齐异常敏感。MicroBlaze的LMB接口,数据总线宽度为32位(4字节),理论上可访问任意字节地址。但BRAM原语RAMB18E1的物理地址线,只接受按字(Word)对齐的地址。当你用C代码*(volatile int*)0x80000001 = 0x12345678;写入一个非对齐地址时,硬件会自动拆分成两次对齐访问(先写0x80000000,再写0x80000004),导致延迟从1周期变成2周期。更隐蔽的是,编译器优化可能自动生成非对齐访问。我们的解决办法是:在xparameters.h中,将LMB挂载的BRAM区域地址,强制声明为__attribute__((aligned(4))),并在所有访问该区域的C代码中,使用memcpy而非直接指针赋值。一次看似微小的地址偏移,足以让LMB的确定性优势荡然无存。

4.3 AXI的“突发长度”陷阱:不是越大越好

AXI突发传输(Burst)是提升带宽的关键,但Vivado默认的MAX_BURST_LENGTH常设为16。在测试中,我们发现当突发长度设为16时,AXI Interconnect的内部仲裁逻辑会显著增加延迟抖动。原因是长突发会“霸占”总线更久,挤压其他Master的请求机会。经过反复测试,我们发现突发长度设为4时,带宽与抖动达到最佳平衡点:16字数据分4次突发传输,总时间仅比单次16字突发多15%,但抖动降低了40%。这个结论颠覆了“越大越好”的直觉,它源于对AXI Interconnect RTL代码的逆向阅读——其仲裁器对短突发有特殊优化。

4.4 时序约束的“最后一公里”:为什么STA报告说“满足”,实测却失败?

这是最折磨人的坑。Vivado的Report Timing显示所有路径Slack > 0,但上板后,AXI读取偶尔返回错误数据。根源在于IO管脚的时序约束遗漏。AXI总线的ARADDR、AWADDR等地址信号,从FPGA输出到外部DDR芯片,需要严格的OUTPUT_DELAY约束。而Vivado默认只约束内部逻辑,对外部走线延迟不做假设。我们曾因忘记添加set_output_delay -clock [get_clocks sys_clk] 1.5 [get_ports {axi_araddr[*]}]这条约束,导致地址信号在DDR采样窗口边缘晃动,故障率约0.1%。解决方法是:用Vivado的I/O Planning工具,精确测量PCB走线长度,结合DDR芯片手册的建立/保持时间要求,手工计算并添加OUTPUT_DELAY和INPUT_DELAY。这一步无法自动化,必须工程师亲手完成。

5. 常见问题与排查技巧实录:来自真实调试现场的速查表

5.1 典型问题速查表

问题现象可能原因排查步骤解决方案
FSL数据接收端始终读不到有效数据FSL_Control信号未正确同步到接收时钟域1. 用ILA抓取发送端FSL_Control和接收端FSL_Control_sync(两级同步后信号)
2. 检查同步后信号是否与接收时钟边沿对齐
在接收端FSL IP的FSL_Control输入前,手动插入两级同步触发器,并确保ASYNC_REG=TRUE
LMB访问BRAM时出现随机数据错误BRAM原语RAMB18E1的WEA(写使能)信号毛刺1. 用ILA抓取LMB_Wr和LMB_WData,观察写使能是否在数据稳定后才有效
2. 检查LMB_Wr是否受复位信号干扰
将LMB_Wr信号通过一级寄存器打拍输出,避免组合逻辑毛刺;确保复位释放后,LMB_Wr有足够建立时间
AXI读事务RVALID迟迟不拉高,系统卡死AXI Interconnect的从设备(Slave)未正确响应ARREADY1. 用ILA抓取ARVALID/ARREADY握手波形
2. 检查从设备IP(如BRAM控制器)的ARREADY信号是否恒为0
在Vivado IP Integrator中,右键点击从设备IP ->Re-customize IP-> 进入AXI Configuration-> 确保Enable Read Address Channel和Enable Read Data Channel均勾选
AXI突发传输效率低下,接近单次传输主设备(Master)未正确配置突发长度1. 用ILA抓取ARLEN(突发长度)信号值
2. 检查C代码中Xil_Out32()等函数是否被编译器优化为单字访问
在访问AXI外设的C代码前,添加#pragma GCC optimize ("O0")禁用优化;或直接使用汇编指令sw配合addi构造地址递增循环
系统在重负载下,MicroBlaze响应延迟突增,但AXI时序报告正常AXI Interconnect的仲裁策略导致MicroBlaze请求被长期延迟1. 用Vivado的Debug Hub监控AXI Interconnect的ARREADY信号占空比
2. 检查ARREADY在MicroBlaze请求期间是否长期为0
在AXI Interconnect IP的Re-customize界面,将MicroBlaze Master的Arbiter Priority设为Highest;或启用Fairness模式,避免某个Master饿死

5.2 独家避坑技巧:节省你至少40小时调试时间

  • 技巧1:用“反向ILA”定位总线死锁
    当AXI系统卡死,常规ILA抓取ARVALID/RVALID可能一无所获,因为死锁发生在握手之前。我们的做法是:在AXI Interconnect的S00_AXI_ARREADY输出端(即连向MicroBlaze的ARREADY信号)上,设置ILA触发条件为== 0,并捕获其前1024个时钟周期的所有相关信号(ARVALID,ARADDR,ARLEN)。这样能清晰看到是哪个地址请求被阻塞,以及阻塞时其他Master的状态,快速定位是地址冲突还是仲裁死锁。

  • 技巧2:LMB的“伪双端口”妙用
    LMB只能连一个主设备(MicroBlaze),但有时需要另一个IP(如DMA)也访问同一块BRAM。不要试图改LMB,而是用Block Memory GeneratorIP,配置为Simple Dual Port模式,将Port A接LMB(供MicroBlaze),Port B接AXI(供DMA)。这样既保留了LMB对MicroBlaze的确定性,又让DMA能通过AXI访问同一物理BRAM,成本几乎为零。

  • 技巧3:FSL的“软件握手”补丁
    当FSL必须用于连续数据流且无法避免丢包时,我们开发了一个轻量级软件协议:发送方每发4个字,附加1个CRC校验字;接收方收到后,立即通过第二个FSL通道回传ACK/NACK。MicroBlaze用极简状态机(3行汇编)处理,开销小于100ns。这虽增加了复杂度,但将FSL的丢包率从37%降至0.01%,在资源极度紧张的老项目中救了急。

  • 技巧4:AXI时序的“保守估算法”
    不必死磕STA报告的精确Slack。我们总结出经验公式:实际安全裕量 ≈ STA Slack × 0.6。因为STA基于理想模型,而实际PCB走线、电源噪声、温度漂移会吃掉约40%的理论余量。若STA显示Slack = 0.5ns,按此公式,实际可用余量仅0.3ns,必须优化。这个系数是我们在12个不同板卡上实测得出的,比盲目相信工具更可靠。

我在某跨平台电机控制项目中,曾因忽略LMB的地址对齐问题,导致整机在高温环境下(>60℃)出现间歇性失控,排查了三天才发现是编译器生成的非对齐访问在高温下触发了BRAM亚稳态。从那以后,所有LMB访问都强制memcpy,并写入团队规范。总线不是黑盒,它是硬件与软件握手的契约,每一个信号、每一行约束、每一次时序收敛,都在无声地定义着系统的确定性边界。这个项目教会我的,不是哪个总线更快,而是如何读懂FPGA在沉默中给出的性能真相。

版权声明: 本文来自互联网用户投稿,该文观点仅代表作者本人,不代表本站立场。本站仅提供信息存储空间服务,不拥有所有权,不承担相关法律责任。如若内容造成侵权/违法违规/事实不符,请联系邮箱:809451989@qq.com进行投诉反馈,一经查实,立即删除!
网站建设 2026/11/4 10:46:18

人机协作中的承诺理论:原理与应用实践

1. 人机协作的承诺理论框架 人机协作中的承诺理论(Commitment Theory)源于社会学和哲学领域,最初用于描述人类社会中个体间的责任约定关系。在智能体系统中,这个概念被扩展为一种形式化的协作机制,通过明确定义各方的义…

作者头像 李华
网站建设 2026/11/4 10:46:17

MySQL事务原理与实战:从ACID特性到并发控制

1. 事务基础概念解析事务(Transaction)是数据库操作的基本工作单元,它代表一组不可分割的SQL操作序列。想象一下银行转账场景:从A账户扣款1000元,同时向B账户增加1000元。这两个操作必须作为一个整体执行,要…

作者头像 李华
网站建设 2026/11/4 10:44:57

Vue3集成ECharts实现数据可视化的实践指南

1. 项目背景与核心需求 作为一名计算机专业的大三学生,我在课程设计中选择了数据分析平台作为实践项目。这个项目的主要目标是构建一个能够处理结构化数据并实现可视化展示的Web应用。在完成基础数据处理功能后,我意识到需要引入专业的可视化组件来提升数…

作者头像 李华
网站建设 2026/11/4 10:43:04

从习题解答看数据结构与算法分析:复杂度推导与实现避坑

简介:这份PDF是Mark Allen Weiss《Data Structures and Algorithm Analysis in C》第二版的配套习题解答手册,面向正在学习数据结构与算法分析课程、需要对照课后练习查漏补缺的高校学生与自学者。内容覆盖算法复杂度分析、表栈队列、树、哈希、优先队列…

作者头像 李华
网站建设 2026/11/4 10:42:52

信息安全概论复习知识地图:从密码学到访问控制与防火墙

简介:面向高校信息安全概论课程学习者与备考人员的试卷汇编文档,围绕课程核心知识点整理多套试题及参考答案,可用于期末复习、章节自测、课堂练习与考前查漏补缺。压缩包内共1个docx文件,整体约21KB,体量轻巧&#xff…

作者头像 李华
网站建设 2026/11/4 10:42:11

Typora 2026评测:专业Markdown编辑器的核心优势

1. Typora 2026深度评测:Markdown编辑器的王者归来 第一次接触Typora是在2018年,当时就被它"所见即所得"的设计理念震撼。七年过去,当市面上涌现出数十款Markdown编辑器后,2026版的Typora依然保持着难以撼动的领先地位。…

作者头像 李华