简介:这份资源面向FPGA数字信号处理初学者与工程实践者,围绕Vivado FFT IP核的仿真验证展开,解决从IP配置、仿真激励搭建到结果正确性核对的完整流程问题,适合已具备Verilog/VHDL基础、希望掌握FFT核实际用法的读者参考。压缩包共约200个文件,整体45.73MB,以vhd与v文件承载FFT核例化与测试平台逻辑,配合do、tcl、bat脚本完成工程编译与仿真启动,xci、dcp记录IP配置与综合结果,log、jou、txt保留运行记录与说明,另有MATLAB的m文件用于结果比对验证。资源已有2534人学习下载,具备一定参考基础。读者可从中获得Vivado2017.4版本可直接打开的完整工程、仿真测试平台代码以及MATLAB验证脚本,便于对照理解FFT核接口时序、数据位宽与输出顺序,并借助脚本快速复现仿真、排查配置与结果偏差问题。
1. 从一次“频谱对不上”的调试说起
去年帮一个做声学采集的团队看板子,他们用 FPGA 做实时频谱分析,上位机画出来的谱线总是比 MATLAB 里跑出来的矮一截,峰值位置还偏了几个 bin。查了两天,问题不在 ADC 采样,也不在窗函数,而是 FFT IP 核的配置位宽和缩放模式没跟 MATLAB 的定点模型对齐——硬件算出来的数被截断了,MATLAB 那边却是双精度浮点。这类“仿真对不上”的坑,几乎每个第一次用 Vivado FFT IP 的人都会踩一遍。
这份资源就是冲着这个痛点来的:一个完整的 Vivado FFT IP 核仿真工程,配套 MATLAB 验证脚本,把“硬件算出来的频谱”和“MATLAB 算出来的频谱”摆在一起对比。它适合两类人——刚接触 Xilinx FFT IP、想搞明白 AXI-Stream 接口怎么喂数据的新手,以及已经在用 FFT 核、但苦于没有可信参考模型做回归验证的熟手。下面按“这项目怎么搭起来 → 怎么跑通 → 怎么改”的顺序拆。
2. 工程结构与 FFT IP 配置:先看清数据是怎么流进去的
2.1 目录骨架与各文件职责
拿到一个 Vivado 工程,别急着点 Run Simulation,先把目录扫一遍。这类 FFT 仿真工程通常长这样(具体文件名以实际工程为准,结构是通用的):
fft_sim_project/ ├── fft_sim.xpr # Vivado 工程文件 ├── fft_sim.srcs/ │ ├── sources_1/ │ │ ├── rtl/ │ │ │ ├── fft_wrapper.v # FFT IP 的封装,处理握手与位宽 │ │ │ └── data_gen.v # 激励生成:正弦/多音/噪声 │ │ └── ip/ │ │ └── xfft_0/ # FFT IP 核实例(.xci) │ ├── sim_1/ │ │ └── tb_fft.v # 顶层 testbench │ └── constrs_1/ │ └── fft_timing.xdc # 时钟约束 ├── matlab/ │ ├── fft_ref_model.m # 浮点参考模型 │ ├── fft_fixed_model.m # 定点模型,对齐 IP 的缩放 │ └── compare_spectrum.m # 读仿真输出、画对比图 └── sim_output/ └── fft_out.txt # testbench 用 $fwrite 导出的结果关键点在于fft_wrapper.v和matlab/这两块:前者决定硬件侧的数据流和位宽处理,后者决定你拿什么当“标准答案”。很多人只跑通仿真看到波形就收工,结果一上板就翻车,就是因为缺了 MATLAB 这一侧的定点对齐。
2.2 FFT IP 核的关键配置项
Vivado 里双击.xci打开 IP 配置界面,下面这几项直接决定仿真结果对不对,逐项说:
| 配置项 | 典型取值 | 影响 |
|---|---|---|
| Transform Length | 1024 / 2048 / 4096 | 决定点数 N,必须和 MATLAB 侧一致 |
| Architecture | Pipelined Streaming I/O | 吞吐最高,适合连续数据流 |
| Data Format | Fixed Point | 定点,需关注位宽与缩放 |
| Input Width | 16 bit | 输入实部/虚部位宽 |
| Phase Factor Width | 16 bit | 旋转因子精度,影响底噪 |
| Scaling Options | Scaled / Unscaled | Scaled 每级右移,Unscaled 全精度输出 |
| Output Ordering | Natural Order | 自然序输出,省得自己重排 |
| AXI-Stream 接口 | 使能 | 用 tvalid/tready/tlast 握手 |
我一般会把 Scaling 设成 Unscaled,让输出位宽自动增长(输入 16 bit、N=1024 时输出约 16+10=26 bit),这样硬件不做截断,MATLAB 侧用同样的全精度定点模型对比,误差来源就只剩旋转因子量化,排查起来干净。如果为了省资源选 Scaled,那 MATLAB 的定点模型必须逐级模拟右移,否则就是你那“谱线矮一截”的翻版。
2.3 AXI-Stream 握手:数据怎么喂进去
FFT 核的从机接口是 AXI-Stream,喂数据必须遵守tvalid & tready握手。封装里最核心的一段通常是这样:
// fft_wrapper.v 片段:把连续样本流打进 FFT 核 always @(posedge aclk) begin if (!aresetn) begin s_axis_data_tvalid <= 1'b0; s_axis_data_tlast <= 1'b0; end else if (src_valid && s_axis_data_tready) begin // 每个时钟送一个复数样本,实部虚部拼成 32bit s_axis_data_tdata <= {src_imag, src_real}; s_axis_data_tvalid <= 1'b1; // 第 N-1 个样本拉高 tlast,标记一帧结束 s_axis_data_tlast <= (sample_cnt == N-1); end else if (s_axis_data_tready) begin s_axis_data_tvalid <= 1'b0; s_axis_data_tlast <= 1'b0; end end逻辑说明:tdata的拼接顺序必须和 IP 配置里“通道数 × 位宽”的排布一致,单通道时低 16 位是实部、高 16 位是虚部,拼反了频谱会镜像。tlast只在每帧最后一个样本拉高一次,FFT 核靠它界定帧边界;如果tlast漏了或者多打了,输出会错位甚至卡死。参数上N要和 IP 的 Transform Length 严格相等,sample_cnt是模 N 计数器。
提示:仿真时如果 FFT 输出一直是 X,先看
s_axis_data_tvalid有没有真正拉起来,再看tlast的周期是不是恰好 N 个时钟。这两个信号是黑匣子里最先要看的。
3. 仿真跑通:从 testbench 到波形再到数据导出
3.1 testbench 的激励与时钟
tb_fft.v干三件事:产生时钟复位、灌激励、把输出写文件。时钟部分没什么好说,100 MHz 对应 10 ns 周期。激励生成建议直接用data_gen.v里的 DDS 或查找表产生单音,频率取k/N * fs这种能整除的 bin,这样 MATLAB 侧理论峰值位置是已知的,对比时一眼能看出偏没偏。
// tb_fft.v 片段:例化 DUT 并抓取输出 xfft_wrapper u_dut ( .aclk(aclk), .aresetn(aresetn), .src_valid(src_valid), .src_real(src_real), .src_imag(src_imag), .m_axis_data_tvalid(m_tvalid), .m_axis_data_tdata (m_tdata), .m_axis_data_tlast (m_tlast) ); // 输出有效时把 26bit 实部/虚部转成十进制写文件 always @(posedge aclk) begin if (m_tvalid && m_tready) begin $fwrite(fd, "%d %d\n", $signed(m_tdata[25:0]), $signed(m_tdata[51:26])); end end这里m_tdata的位宽切分要按 IP 实际输出位宽来,Unscaled 模式下实部和虚部各占一段,切错了 MATLAB 读进去就是乱码。$fwrite每行写一个复数样本,方便后面 MATLAB 用load直接读成矩阵。
3.2 跑仿真的具体步骤
命令行或 GUI 都行,我习惯用 Tcl 批处理,可复现:
# 在工程目录下,用 Vivado 批处理模式跑仿真 vivado -mode batch -source run_sim.tclrun_sim.tcl里核心就三行:
open_project fft_sim.xpr launch_simulation run all跑完在sim_output/fft_out.txt拿到硬件输出。GUI 用户则是在 Flow Navigator 里点 Run Simulation → Run Behavioral Simulation,等波形出来后确认m_tvalid有连续 N 个周期的高电平、m_tlast恰好出现一次,再让仿真跑够至少两帧,避免只抓到半帧。
3.3 MATLAB 侧的对齐与对比
MATLAB 脚本的作用不是“再算一遍 FFT”,而是用和硬件完全相同的定点规则算一遍。fft_fixed_model.m里关键是把输入量化到 16 bit、把旋转因子量化到配置的 Phase Factor Width,然后调用fi定点对象做 FFT:
% fft_fixed_model.m:与 IP 对齐的定点 FFT N = 1024; x = fi(input_samples, 1, 16, 15); % 有符号 16bit,15 位小数 tw = fi(exp(-2j*pi*(0:N-1)/N), 1, 16, 15); % 旋转因子同精度 X_fix = fi(zeros(1,N), 1, 26, 15); % 输出位宽按 IP 增长 for k = 1:N acc = fi(0, 1, 26, 15); for n = 1:N acc = acc + x(n) * tw(mod((n-1)*(k-1), N)+1); end X_fix(k) = acc; end逻辑说明:fi(...,1,16,15)表示有符号、总位宽 16、小数位 15,对应 Q1.15 格式,和 IP 的 Input Width 16 bit 对齐。输出位宽 26 是按 Unscaled 模式估算的,实际以 IP 报告为准。compare_spectrum.m则把fft_out.txt读进来做fftshift和20*log10(abs(...)),和X_fix画在同一张图上,看两条谱线是否重合、峰值 bin 是否一致、底噪差多少 dB。
注意:MATLAB 读文件时注意
$fwrite写的是十进制有符号数,用load('fft_out.txt')读成 N×2 矩阵后第一列实部第二列虚部,别把行列搞反。
4. 避坑与排查:五个真实踩过的坑
4.1 现象:输出频谱整体镜像
原因:tdata里实部虚部拼反了,或者 MATLAB 侧把 I/Q 顺序读反。FFT 对复数输入敏感,I/Q 互换等价于共轭,频谱直接左右翻转。解决:对照 IP 配置界面的“Channel Data”排布说明,确认低半字是实部;MATLAB 读文件后打印前几个样本和 testbench 里$display的值比对。
4.2 现象:峰值幅度比 MATLAB 低 6 dB 或 12 dB
原因:Scaling 模式选了 Scaled,IP 每级自动右移,而 MATLAB 模型没模拟这个右移;或者反过来,硬件 Unscaled 而 MATLAB 用了fft()默认的浮点归一化。解决:把 IP 的 Scaling 和 MATLAB 模型的缩放策略写成一张对照表,两边逐级核对。我一般直接选 Unscaled,省掉这层对齐。
4.3 现象:仿真跑不完,m_tvalid一直不拉高
原因:tlast没在正确位置拉高,FFT 核认为一帧没结束,不吐结果;或者tready被上游一直拉低。解决:在波形里量s_axis_data_tlast相邻两次高电平之间的时钟数,必须等于 N;再看s_axis_data_tready是否在复位释放后拉高。
4.4 现象:MATLAB 读进来的数据全是 0 或乱码
原因:$fwrite的文件句柄没打开成功,或者仿真没跑够时间文件没 flush。解决:testbench 里$fopen后检查返回值非 0,仿真结束前加$fclose;文件路径用相对路径时注意 Vivado 仿真的工作目录是sim_1/behav/xsim,不是工程根目录。
4.5 现象:换 N 之后结果全错
原因:只改了 IP 的 Transform Length,忘了改 testbench 里的N参数和 MATLAB 脚本里的N,三处不一致。解决:把 N 抽成一个parameter或宏,testbench、wrapper、MATLAB 脚本头部各留一处,改的时候三处同步,最好在脚本里加一句断言assert(N == 1024)。
5. 二次开发:把仿真工程变成你自己的验证台
这套工程最大的价值不是“跑通一次”,而是可以当模板反复用。我一般会做三件事把它改造成自己的回归验证台。
第一,把激励源参数化。data_gen.v里现在可能是固定单音,改成通过parameter控制频率字、幅度和信噪比,这样一次仿真能覆盖单音、多音、带噪三种场景,不用每次改代码重编译。频率字建议取round(k * 2^W / N)这种能精确落在 bin 上的值,避免频谱泄漏干扰对比。
第二,把 MATLAB 对比脚本做成自动判定。现在compare_spectrum.m是画图靠人眼看,改成算峰值 bin 偏差和最大幅度误差,超过阈值就error()退出,配合vivado -mode batch就能塞进 CI。判定逻辑大概是这样:
% 自动判定:峰值 bin 偏差 + 归一化幅度误差 [~, idx_hw] = max(abs(X_hw)); [~, idx_ref] = max(abs(X_fix)); bin_err = abs(idx_hw - idx_ref); amp_err = abs(20*log10(abs(X_hw(idx_hw))/abs(X_fix(idx_ref)))); assert(bin_err <= 1, '峰值 bin 偏差 %d,超过容限', bin_err); assert(amp_err < 0.5, '幅度误差 %.2f dB,超过容限', amp_err);bin_err容限给 1 是考虑定点量化可能让峰值在相邻 bin 间抖动,amp_err给 0.5 dB 是经验值,实际按你的 Phase Factor Width 调。这套断言一上,改 IP 配置或改 wrapper 之后跑一遍就知道有没有回归。
第三,把输出位宽和缩放策略做成配置表。不同 N、不同 Scaling 模式下输出位宽不一样,硬编码切位在换配置时必翻车。我的习惯是在 wrapper 里用localparam根据 N 和 Scaling 算出OUT_WIDTH,testbench 和 MATLAB 脚本从同一个配置文件读,三处永远一致。
血泪经验是:每次改 IP 配置,哪怕只改了一个 Phase Factor Width,也要把 MATLAB 定点模型同步改掉再跑对比,否则你看到的“通过”只是两边都错得一样。从那以后我每次动.xci都强制走一遍“改配置 → 同步 MATLAB → 跑仿真 → 看断言”的流程,再没出现过上板才发现频谱对不上的事。希望帮到你。
本文还有配套的精品资源,点击获取