简介:本资源是Xilinx官方《Vivado HLS教程》UG871中文版(2020.1版)PDF文档,面向FPGA开发初学者及Zynq平台工程师,聚焦高层次综合(HLS)技术落地——解决用C/C++快速实现硬件逻辑、缩短FPGA开发周期的核心痛点。文档共1个PDF文件,大小20.08MB,内容结构完整:涵盖HLS项目创建、Tcl命令接口实操、解决方案级优化、C/C++验证(含任意精度类型)、块级I/O协议等6大实验模块,每章均含设计说明与分步指导,适合作为系统性学习与工程参考手册。已有342人学习下载,读者可直接获取Xilinx权威方法论、标准实验流程、典型调试要点及版本修订说明,无需二次整理即可用于课程教学、项目预研或HLS入门实践。
1. Vivado HLS 不是“C 代码自动变 FPGA”:它把 C 函数编译成带时序约束的 RTL 黑匣子,而真正决定性能上限的,是开发者对数据流、控制流和接口协议的显式建模能力
你写完一个 FIR 滤波器的 C 函数,点下 “Run C Synthesis”,Vivado HLS 真的只是“翻译”了一下语法?错。它在后台干了一件更本质的事:把你的for (i=0; i<128; i++) { acc += coef[i] * data[i]; }这行代码,拆解成一个带精确时钟周期标注的状态机 + 数据通路 + 接口握手逻辑——这个状态机里没有for,只有state_idle → state_load → state_multiply → state_accumulate → state_store;这个数据通路里没有acc变量,只有ACC_REG : std_logic_vector(31 downto 0)和一组MUL_UNIT的并行实例;这个接口握手逻辑里没有data[i]数组访问,只有data_valid,data_ready,data_tdata三根信号线组成的 AXI-Stream 协议。UG871 教程第 2 章实验 1 用 FIR 滤波器开篇,绝非偶然:它逼你直面一个反直觉事实——HLS 不是帮你省掉 RTL 编程,而是把 RTL 编程的决策点,提前挪到了 C 代码的注释、函数签名、数组声明和测试台结构里。你写的#pragma HLS PIPELINE II=1不是魔法开关,它是向编译器下达的“请把这层循环展开成 128 个并行乘法器,并用寄存器级联它们”的硬性指令;你把coef[128]声明为const int coef[128]而不是int coef[128],不是为了语义正确,而是告诉 HLS:“这块内存必须综合成 ROM,别给我生成 RAM 写使能逻辑”。这份 2020.1 版本的中文 UG871,表面是操作步骤罗列,内核却是 Xilinx 工程师用十年 HLS 实践沉淀下来的设计契约手册:它不教你怎么点按钮,它教你怎么在 C 层面“画出”你想要的硬件电路图。搞懂它,你才不会在 Zynq SoC 上跑通了 C 仿真就以为万事大吉,结果 RTL 综合后吞吐量卡在 50MHz、资源占用爆表、AXI 接口死锁——那不是工具不行,是你没签好这份契约。
2. 高级综合的本质:从 C 函数到可综合 RTL 的三重映射机制
Vivado HLS 的核心不是“编译器”,而是一个三阶段映射引擎:它把高级语言描述的算法行为(Behavior),映射到硬件结构(Structure),再绑定到物理时序(Timing)。UG871 第 2 章的 FIR 实验,正是这三重映射的完整沙盘推演。我们不看 GUI 点击步骤,直接拆解其底层机制。
2.1 行为建模:C 代码如何被解析为“可综合子集”
HLS 对 C/C++ 的支持有严格边界。UG871 明确指出:“仅支持 ANSI C89/C99 子集,禁用动态内存分配(malloc/free)、递归、函数指针、异常处理”。这不是技术限制,而是可综合性的数学约束。原因在于:综合过程必须保证所有执行路径在编译期可静态分析,以生成确定的硬件资源。例如:
// ✅ 可综合:循环边界固定,数据依赖清晰 void fir_filter(int data_in, int *out) { static int shift_reg[128]; int i; // 移位寄存器更新 for(i = 127; i > 0; i--) { shift_reg[i] = shift_reg[i-1]; } shift_reg[0] = data_in; // 累加计算 int acc = 0; for(i = 0; i < 128; i++) { acc += coef[i] * shift_reg[i]; // coef[] 是 const 全局数组 } *out = acc; }这段代码能被综合,关键在三点:
static int shift_reg[128]:static关键字强制 HLS 将其综合为片上 Block RAM(BRAM)或分布式 RAM,而非试图用触发器阵列模拟;若改为int shift_reg[128](栈变量),HLS 会报错或生成极低效逻辑。coef[i]访问无写操作:coef声明为const int coef[128] = {...},HLS 识别为只读常量,自动综合为 ROM 查表结构,面积最小化。- 循环无数据依赖环:内层累加
acc += ...是顺序依赖,HLS 默认按串行实现;但通过#pragma HLS PIPELINE II=1,它被重写为并行流水线——这引出了第二重映射。
提示:UG871 第 2 章实验 3 的优化对比,本质就是展示同一段 C 代码在不同
#pragma指令下,行为模型如何被重解释。不加 pragma 是“顺序执行 128 步”,加PIPELINE是“128 个乘法器同时工作,每周期吐一个结果”。
2.2 结构映射:Pragma 指令如何驱动硬件架构生成
#pragma HLS不是注释,是 HLS 编译器的硬件架构指令集。UG871 第 2 章实验 3 用三个解决方案对比,实则是演示三类核心 pragma 如何改写硬件蓝图:
| Pragma 类型 | 示例 | 硬件结构影响 | UG871 中对应实验 |
|---|---|---|---|
| Pipeline | #pragma HLS PIPELINE II=1 | 将循环体展开为深度为II的流水线,每个 stage 包含独立的 ALU、寄存器;消除 loop-carried dependency | 实验 3 Step 2: 创建 solution2 |
| Unroll | #pragma HLS UNROLL factor=4 | 将循环完全展开为factor个并行实例,消除循环控制逻辑;适合小范围、无依赖循环 | 实验 3 Step 3: 创建 solution3 |
| Array Partition | #pragma HLS ARRAY_PARTITION variable=shift_reg complete dim=1 | 将数组shift_reg[128]拆分为 128 个独立寄存器,支持全并行读写;否则默认综合为单端口 RAM,一次只能读/写一个元素 | 第 4 章实验 3: 数组实现为 RTL 接口 |
关键机制在于:这些 pragma 直接修改 HLS 的数据流图(DFG)。原始 C 代码的 DFG 是一个串行链表;PIPELINE将其切片为水平层级;UNROLL将其复制为垂直并行分支;ARRAY_PARTITION则将内存节点替换为 128 个独立寄存器节点。UG871 的“Solution Explorer”界面里显示的csim,syn,sim文件夹,本质就是这三重映射的产物:csim是行为模型验证,syn是结构映射输出(含生成的 Verilog 和资源报告),sim是时序绑定后的 RTL 仿真。
2.3 时序绑定:时钟周期约束如何决定硬件物理实现
UG871 第 2 章图 2-6 的“Solution Configuration”窗口中,Target Clock Period: 10ns(即 100MHz)不是建议值,而是硬性时序契约。HLS 编译器据此执行两项关键操作:
- 关键路径拆分(Critical Path Breaking):若
coef[i] * shift_reg[i]乘法器延迟 > 10ns,HLS 自动插入一级流水寄存器,将乘法拆为mul_low+mul_high两级,满足时序;代价是增加一拍延迟(latency)。 - 资源-时序权衡(Area-Timing Tradeoff):当
II=1且clock=10ns无法满足时,HLS 不会报错,而是降级为II=2,即每 2 个时钟周期输出一个结果——这直接体现为“Throughput = 1/result_per_2_cycles”,而非你期望的1/cycle。
这就是为什么 UG871 强调“不要先写代码再定频率”。你在fir.c顶部写#define CLK_PERIOD 10,就是在给 HLS 下达物理定律:它必须在这个约束下,为你生成能稳定运行的门级网表。Zynq SoC 的 PS-PL 接口时钟域(如 100MHz PL_CLK)与 HLS 设计的时钟约束必须严格对齐,否则 AXI 总线握手会因 setup/hold 违例而死锁——这已不是功能问题,而是物理层失效。
3. C 验证:为什么“C 仿真通过”不等于“RTL 功能正确”,以及任意精度类型如何成为精度守门员
UG871 第 3 章标题叫“C 验证”,但它的真正价值在于揭示一个残酷现实:C 仿真(C-sim)只是功能正确性的必要不充分条件。它能证明你的算法逻辑没错,但完全无法保证 HLS 综合出的 RTL 在位宽、舍入、溢出、时序行为上与 C 模型一致。第 3 章的三个实验,层层剥开这个黑匣子。
3.1 C 仿真与 RTL Cosimulation 的根本差异
C 仿真运行在 x86 CPU 上,使用 IEEE 754 浮点、32/64 位整数,运算无限精度(无溢出)、无延迟、无并发竞争。而 RTL Cosimulation 运行在仿真器(如 XSIM)中,使用定点数、有限位宽、纳秒级延迟、真实时序驱动。UG871 第 3 章实验 1 的fir_test.c测试台,表面看只是调用fir()函数,实则埋着三重陷阱:
// fir_test.c 片段(UG871 P45) int main() { int in_data[100], out_data[100]; int gold_out[100]; // 1. 从 out.gold.dat 读取黄金数据(32位有符号整数) read_gold_data("out.gold.dat", gold_out, 100); // 2. C 仿真:调用 fir(),结果存入 out_data[] for(int i=0; i<100; i++) { fir(in_data[i], &out_data[i]); } // 3. 比较:逐元素 memcmp(out_data, gold_out) return (memcmp(out_data, gold_out, sizeof(out_data)) == 0) ? 0 : 1; }这段代码在 C 仿真中 100% 通过,但 RTL Cosimulation 可能失败。原因在于:
- 位宽截断:C 中
int是 32 位,但 HLS 默认将int综合为 32 位std_logic_vector;若fir()内部累加acc超过 32 位(如 128 个 16-bit 系数相乘累加),C 仿真会自动扩展为 64 位,而 RTL 会硬截断为低 32 位,导致结果偏差。 - 舍入模式:C 的
/运算向零舍入,而 HLS 的ap_fixed默认饱和舍入(saturation),需显式指定AP_RND。 - 时序行为:C 仿真中
fir()是原子函数,瞬间返回;RTL 中它可能需要 10 个时钟周期,测试台若未等待data_valid信号,就会读到无效数据。
UG871 的“C 验证”流程,本质是构建一个双轨验证通道:C-sim 作为黄金参考,RTL Cosim 作为待测设备,二者输入完全相同,输出必须逐比特一致。这要求测试台本身必须是“时序感知”的——这也是第 8 章 RTL 验证的核心。
3.2 任意精度类型:用ap_int/ap_fixed替代int/float的底层动机
UG871 第 5 章专讲任意精度类型,绝非炫技。ap_int<16>与int的区别,是抽象层与物理层的鸿沟:
| 特性 | int(C) | ap_int<16>(HLS) |
|---|---|---|
| 位宽 | 平台相关(通常 32 位) | 精确 16 位,综合为 16 根 wire |
| 溢出行为 | 未定义(UB),通常 wrap-around | 可配置:AP_WRAP(回绕)或AP_SAT(饱和) |
| 运算延迟 | 无概念 | 综合为 16-bit 加法器,延迟 ~1ns(取决于工艺) |
| 资源映射 | 无 | 直接对应 FPGA LUT/FF 数量,可精确预估 |
UG871 第 5 章实验 1 的对比实验,用int和ap_int<16>实现同一 FIR,结果int版本综合后面积暴增 300%,因为 HLS 为兼容 32 位int的全范围运算,生成了冗余的高位比较逻辑;而ap_int<16>明确告知 HLS:“我只需要 16 位”,编译器直接生成最简 16-bit 加法器。更关键的是精度控制:FIR 系数常为小数(如 0.125),用float综合会引入不可控的浮点单元(占用大量 DSP slice),而ap_fixed<16,6>(16 位总长,6 位小数)能精确表示 0.125(二进制0.001),且综合为纯组合逻辑,零额外开销。
注意:UG871 P96 明确警告:“
ap_int/ap_fixed必须在顶层函数参数、全局变量、局部变量中全程使用,禁止与int/float混用”。因为混用会触发隐式类型转换,HLS 无法推断位宽,退化为保守的宽位宽实现。
3.3 C 调试环境:如何定位 HLS 生成的 RTL 与 C 模型的偏差
UG871 第 3 章实验 1 的调试流程,暴露了 HLS 最易被忽视的能力:C 级别波形调试。当你在 Vivado HLS GUI 中点击 “Debug C Simulation”,它并非运行 GDB,而是启动一个C 代码与 RTL 信号的联合追踪器。其机制如下:
- 源码插桩(Instrumentation):HLS 编译器在
fir.c的关键变量(如acc,shift_reg[i])处插入printf或hls::trace调用,记录每次赋值的值和时间戳。 - RTL 信号捕获:在生成的 Verilog 中,为
acc_reg、shift_reg_ram等关键信号添加(* keep="true" *)综合属性,确保它们不被优化掉。 - 时间对齐比对:C 仿真日志的时间戳(虚拟 cycle)与 RTL 仿真波形(实际 ns)通过
#pragma HLS CLOCK_DOMAIN关联,GUI 将二者同步显示在同一时间轴上。
若发现 C 中acc=0x12345678,而 RTL 中acc_reg=0x5678,立刻可知是位宽截断;若 C 中shift_reg[0]在 cycle 10 更新,而 RTL 中shift_reg_ram_we在 cycle 12 才拉高,则是流水线延迟未对齐。这种调试能力,让 HLS 从“黑盒编译”变为“白盒可观测系统”——这正是 UG871 把 C 验证单独成章的深意。
4. 接口综合:当 C 函数的参数变成 AXI 总线,你必须亲手设计握手协议
UG871 第 4 章标题“Interface Synthesis”,直指 HLS 最易被低估的环节:函数参数到硬件端口的映射,不是自动的,而是设计决策。void fir(int data_in, int *out)这个签名,在软件里是两个参数;在 HLS 里,它会被综合为三种截然不同的硬件接口,而选择权完全在你——#pragma HLS INTERFACE指令就是你的接口设计图纸。
4.1 三种基础接口协议:s_axilite、s_axi、axis 的硬件本质
UG871 第 4 章实验 1-4 逐步升级接口复杂度,其底层逻辑是 FPGA 物理接口的演进史:
| 接口类型 | #pragma HLS INTERFACE | 物理实现 | 适用场景 | UG871 实验 |
|---|---|---|---|---|
| s_axilite | m_axi port=return bundle=gmem | AXI4-Lite 总线,32-bit 地址/数据,单次读写 | 控制寄存器、配置参数(如滤波器系数加载地址) | 实验 1: 块级 I/O |
| m_axi | m_axi port=data offset=slave bundle=gmem | AXI4-Full 总线,支持突发传输(burst),64/128-bit 数据总线 | 大块数据搬运(如图像帧、音频 buffer) | 实验 3: 数组实现为 RAM |
| axis | axis port=data | AXI4-Stream 协议,tvalid/tready握手,tdata数据流 | 实时流式数据(如视频像素流、传感器采样流) | 实验 4: AXI4 接口 |
关键洞察:s_axilite和m_axi都是地址映射型接口,需要 CPU 主动发起读写;而axis是流控型接口,由数据生产者(HLS 模块)和消费者(另一个模块)通过tvalid/tready信号协商速率。UG871 实验 4 的 AXI4 Stream 实现,其fir函数签名必须改为:
void fir( hls::stream<int>& data_in, // 输入流:由 tvalid/tready 驱动 hls::stream<int>& data_out, // 输出流:同上 int coef[128] // 系数数组:通过 s_axilite 加载 );这里hls::stream<T>不是 STL 容器,而是 HLS 提供的硬件流通道抽象,其底层综合为tdata,tvalid,tready,tlast四根信号线。若你错误地用int* data_in并加m_axi,HLS 会生成 AXI4-Full 总线逻辑,要求 CPU 按地址逐一写入 100 个数据——这在实时流场景下必然超时崩溃。
4.2 数组综合:从int buf[1024]到 BRAM/FIFO 的显式选择
UG871 第 4 章实验 3 的核心,是破除“数组=内存”的思维定式。int buf[1024]在 C 中是连续内存,在 HLS 中却是三种硬件资源的候选:
| 综合方式 | #pragma HLS指令 | 硬件资源 | 时序特性 | UG871 示例 |
|---|---|---|---|---|
| Block RAM | #pragma HLS RESOURCE variable=buf core=RAM_2P | BRAM 块 | 双端口,读写独立,延迟 ~1 cycle | 实验 3 Step 1 |
| Distributed RAM | #pragma HLS RESOURCE variable=buf core=RAM_SDP | LUTs | 单端口,读写不能同时,延迟 ~1 cycle | 实验 3 Step 2 |
| FIFO | #pragma HLS STREAM variable=buf depth=1024 | BRAM + 控制逻辑 | 生产者/消费者异步,自动处理满/空 | 实验 3 Step 3 |
选择依据不是“哪个快”,而是数据访问模式:
- 若
buf用于 FIR 的移位寄存器(顺序读写),选STREAM,FIFO 自动处理背压; - 若
buf用于 FFT 的位反转查表(随机地址访问),选RAM_2P,双端口避免冲突; - 若
buf很小(< 64 字),选RAM_SDP,省 BRAM 资源。
UG871 的实验设计,强迫你为每个数组做此决策。这正是 HLS 的设计哲学:把硬件资源选择权,从综合器手中,交还给架构师。
4.3 AXI4 接口集成:为什么#pragma HLS INTERFACE s_axilite port=return是 Zynq PS-PL 通信的生命线
UG871 第 10 章 Zynq SoC 实验,其成败关键在s_axilite接口。Zynq 的 Processing System(PS)通过 AXI4-Lite 总线访问 PL 中的 HLS IP 寄存器。port=return这个看似随意的参数,实则是 HLS 自动生成的控制寄存器组基地址。其机制如下:
- HLS 为函数所有
s_axilite参数(包括return)分配连续的 32-bit 寄存器地址:return→ offset0x00(通常为状态寄存器)coeff_addr→ offset0x04(系数起始地址)coeff_len→ offset0x08(系数长度)
- Zynq PS 的 ARM Cortex-A9/A53 通过
Xil_Out32(BASE_ADDR + 0x04, 0x1000)向coeff_addr写入 0x1000,即告诉 HLS 模块:“我的系数存在 PL 的 0x1000 地址”。 - HLS 模块内部的
m_axi接口,根据此地址发起 AXI4-Full 读请求,从 PS 的 DDR 中搬系数。
若你遗漏#pragma HLS INTERFACE s_axilite port=return,HLS 不会生成任何 AXI-Lite 寄存器,Zynq PS 就像对着一堵墙发指令——永远得不到响应。UG871 第 10 章实验 1 的“Zynq CPU 和 HLS 加速器块之间的流数据”,其底层就是s_axilite(控制)+axis(数据流)的双总线协同。这是 HLS 在 SoC 场景落地的基石协议。
5. 避坑指南:UG871 实验中高频踩坑的 4 类血泪经验
UG871 是一份经过千锤百炼的教程,但它的“标准路径”恰恰掩盖了真实项目中最易翻车的细节。以下是基于该文档实验复现总结的 4 类致命坑,每一条都来自某开发者在 Zynq 板卡上抓狂 3 天的真实记录:
5.1 C 仿真通过但 RTL Cosimulation 失败:位宽与初始化的双重陷阱
- 现象:
fir_test.cC-sim 输出与out.gold.dat完全一致,但 RTL Cosim 中out.dat文件为空,或内容全为 0。 - 原因:
- 测试台未初始化
out_data数组:C-sim 中未初始化的栈变量可能为 0,但 RTL 中out_data综合为寄存器阵列,上电值未知(X),导致out.dat写入乱码; out.gold.dat文件路径错误:UG871 要求解压到C:\Vivado_HLS_Tutorial,若放在D:\project\,C-sim 因当前工作目录不同而读不到文件,但fopen返回 NULL 未检查,memcmp比较空内存,侥幸通过;RTL Cosim 则严格按 project path 查找,必然失败。
- 测试台未初始化
- 解决:在
fir_test.c开头强制初始化out_data:int out_data[100] = {0};;并在read_gold_data()后加assert(fp != NULL && "gold file not found");。
5.2 Pipeline II=1 无法满足时序:循环依赖与资源不足的混淆
- 现象:添加
#pragma HLS PIPELINE II=1后,Synthesis 报告Timing is not met,但Utilization显示 LUT 使用率仅 40%。 - 原因:
II=1失败通常不是资源不够,而是循环内存在无法打破的数据依赖。例如 FIR 中acc += coef[i] * shift_reg[i],若shift_reg[i]的更新依赖于前一拍的data_in,而data_in又来自外部 AXI 总线(延迟不确定),HLS 无法保证i和i+1的计算能在 1 个周期内完成。 - 解决:
- 检查
Dataflowpragma:对 FIR 这类流水线结构,应加#pragma HLS DATAFLOW,让 HLS 将shift_reg更新、multiply、accumulate三个阶段并行化; - 降低
II值:尝试II=2或II=4,观察 Timing Report 中 Critical Path 的具体路径(如mul_unit -> adder -> reg),针对性优化该路径(如对mul_unit加#pragma HLS RESOURCE core=Mul_LUT强制用 LUT 实现,而非 DSP)。
- 检查
5.3 AXI4 Stream 接口死锁:tvalid/tready 握手逻辑缺失
- 现象:Zynq PS 通过
Xil_Out32()启动 HLS 模块后,PS 端Xil_In32()读取结果永远阻塞,逻辑分析仪看到tvalid=1但tready=0恒定。 - 原因:
hls::stream的tready信号由下游模块驱动。若 HLS 模块是数据终点(如直接连 LED),你必须在 RTL 中手动拉高tready;若连到另一个 HLS 模块,下游模块未启用#pragma HLS INTERFACE axis,则tready无驱动,呈高阻态(Z),被上拉电阻拉为 1,但实际未连接。 - 解决:
- 在 HLS 模块顶层,为
axis输出端口添加#pragma HLS INTERFACE ap_ctrl_none port=return(禁用自动控制); - 手动在
fir()函数内添加tready驱动逻辑:if (!data_out.full()) data_out.write(acc);(full()方法会自动生成tready逻辑); - 在 Zynq SDK 中,确认
Xil_Out32()写入的是CTRL寄存器(offset0x00),而非其他寄存器。
- 在 HLS 模块顶层,为
5.4 Zynq PS-PL 通信失败:时钟域与地址映射错配
- 现象:HLS IP 在 Vivado Block Design 中已正确连接
S_AXI到 Zynq 的S_AXI_HP0,但 PS 端Xil_Out32(BASE_ADDR + 0x04, val)无任何响应,AXI Monitor 显示无事务。 - 原因:
- 时钟未连接:Zynq 的
S_AXI_HP0需要HP0_FCLK_CLK0时钟,若 Block Design 中未将clk_wiz_0的clk_out1连接到S_AXI_HP0_ACLK,AXI 总线物理上无法工作; - 地址映射未发布:在 Vivado Block Design 中,右键
zynq_ultra_ps_e_0→Validate Design后,必须点击Address Editor→Auto Assign Address,否则BASE_ADDR在 SDK 中不可见。
- 时钟未连接:Zynq 的
- 解决:
- 在 Block Design 中,确认
zynq_ultra_ps_e_0/S_AXI_HP0_ACLK连接到正确的时钟源; Validate Design→Address Editor→Auto Assign Address→Generate Address Block→Export Hardware(勾选Include bitstream)→Launch SDK;SDK 中xparameters.h的XPAR_<IP_NAME>_BASEADDR即为正确地址。
- 在 Block Design 中,确认
6. 设计取舍:当 HLS 遇到 Zynq SoC,你必须在“C 代码简洁性”和“硬件可控性”之间划一条线
UG871 第 10 章 Zynq 实验的终极启示,不是教会你如何点几下鼠标,而是逼你直面一个设计哲学问题:HLS 的抽象层级,到底应该停在哪一层?是追求 C 代码的极致简洁(写一个void process_image(uint8_t* img)),还是接受在 C 层面显式建模硬件行为(void process_image(hls::stream<ap_uint<8>>& pix_in, hls::stream<ap_uint<8>>& pix_out))?我的答案是:在 Zynq SoC 场景下,必须停在hls::stream和ap_*类型这一层,再往上走就是玄学,再往下走就是 RTL。
6.1 为什么hls::stream是 Zynq HLS 的黄金分割点?
Zynq 的本质是“ARM CPU + FPGA PL”的异构系统,二者通信带宽瓶颈在 AXI 总线。hls::stream的设计,完美匹配这一物理约束:
- 零拷贝(Zero-Copy):
hls::stream综合为 AXI4-Stream,数据直接从 PS 的 DDR 通过 HP 接口流入 PL,无需 CPU 搬运;而uint8_t* img强制使用m_axi,CPU 必须memcpy到 PL 的 BRAM,带宽损失 50% 以上。 - 背压(Backpressure):
tvalid/tready握手天然支持速率匹配。当 PL 的 FIR 模块处理不过来,它拉低tready,PS 的 DMA 自动暂停,避免数据丢失;若用m_axi,PS 只能靠轮询状态寄存器,引入毫秒级延迟。 - 资源可预测:
hls::stream<ap_uint<8>>综合为 8-bittdata+ 1-bittvalid/tready,资源恒定;而uint8_t*的m_axi接口,位宽、突发长度、地址宽度全由 HLS 推断,极易因 DDR 控制器配置变化而波动。
UG871 第 10 章实验 2 的“Zynq CPU 和 HLS 加速器块之间的流数据”,其核心代码hls::stream<int> data_in, data_out;不是语法糖,而是对 Zynq 物理拓扑的精准建模——它把“CPU 发送数据流”这个行为,直接映射为“AXI4-Stream 协议”。
6.2 何时必须放弃 HLS,回归 RTL?三个明确信号
UG871 的魅力在于它展示了 HLS 能做什么,但真正的高手,必须知道它不能做什么。以下三个信号出现时,立即停止 HLS,切回 Verilog/VHDL:
- 需要精确控制时序路径:如要求某个信号从输入到输出严格 3 个时钟周期,且不能有任何组合逻辑毛刺。HLS 的
#pragma HLS LATENCY min=3 max=3只是目标,实际综合可能因布局布线失败;而 RTL 中assign y = #3 x;是铁律。 - 涉及复杂状态机(> 10 个状态)且有异步复位/多时钟域:HLS 对
async_reset支持有限,多时钟域(如 PS 的 100MHz 与 PL 的 200MHz)需手动跨时钟域同步(CDC),HLS 无法自动生成可靠的 FIFO 或握手逻辑。 - IP 需要与第三方 RTL 模块深度耦合:如 HLS 模块必须与 Xilinx 的
AXI DMAIP 的s_axis_s2mm_cmd接口对接,该接口有 12 个控制信号(cmd_valid,cmd_ready,cmd_opcode...),HLS 的#pragma HLS INTERFACE无法精细控制每个信号的时序和驱动
本文还有配套的精品资源,点击获取